program: Gaussian 09
title: 000090375
version: EM64L-G09RevD.01
frameworkgroup: C1[X(C16H20)]
method: RPBEPBE
basis: SDD
operation: Freq
keyword: #p
keyword: freq=noraman
keyword: PBEPBE/SDD
title: #p freq=noraman PBEPBE/SDD
converged: YES YES NO NO
title: Mulliken charges:
elementType: C C C C C C C C C C C C C C C C H H H H H H H H H H H H H H H H H H H H
charge: 0.423551 0.423551 -0.215187 -0.215186 0.180180 0.180182 -0.493162 -0.493162 -0.699081 -0.699118 -0.699100 -0.699099 -0.411413 -0.411414 -0.269364 -0.269364 0.203099 0.203098 0.227139 0.227139 0.213181 0.211725 0.228731 0.228736 0.211729 0.213127 0.213156 0.211727 0.228733 0.228733 0.211727 0.213152 0.220712 0.220713 0.225414 0.225414
chargesum: 0.00000
title: Mulliken charges with hydrogens summed into heavy atoms:
elementType: C C C C C C C C C C C C C C C C
charge: 0.423551 0.423551 -0.012088 -0.012088 0.180180 0.180182 -0.266023 -0.266022 -0.045443 -0.045526 -0.045483 -0.045487 -0.190701 -0.190701 -0.043951 -0.043950
polarizability: 2.12290993e+02 -4.31257571e-05 2.09733116e+02 -3.37719509e-03 1.43719611e-02 1.07214167e+02
1716.lowfreq: -31.9084 -28.1574 -13.1853 -5.1583 -0.0005 0.0003 0.0007 9.7596 53.8188
frequency: -30.8378 -26.9306 53.4423 95.6037 156.0113 171.8435 182.8467 205.7509 213.2897 215.7473 234.5659 238.2568 249.2350 290.5947 290.7920 394.4802 426.2200 431.1351 431.7910 468.3751 473.4795 485.7851 567.1803 582.3737 637.5940 663.5053 683.1328 687.9112 772.2395 784.8593 798.4837 850.7427 857.6431 875.6351 883.2128 913.1042 913.3472 951.2130 952.4063 957.7434 963.7869 968.9795 986.6053 1013.2976 1037.7194 1048.3764 1071.7385 1113.5777 1113.8851 1148.9392 1159.8840 1177.2113 1178.6620 1193.5196 1245.5293 1246.4753 1260.4907 1297.9595 1297.9935 1302.9558 1332.9577 1365.7961 1376.3560 1376.4245 1388.0761 1395.4807 1397.7586 1404.2152 1440.6027 1456.6261 1464.4857 1464.7825 1468.0823 1468.2669 1478.7437 1478.8564 1484.6460 1486.4699 1525.9527 1590.7207 1595.1879 1622.5868 2973.7572 2973.8188 2976.2818 2976.7473 3022.9643 3023.2695 3066.6453 3066.7216 3074.4195 3074.9248 3076.9813 3077.0796 3082.9273 3083.2574 3112.6235 3125.1583 3136.7205 3139.7661 3155.1166 3166.1535
redmass: 2.4885 2.8132 3.2451 3.3333 2.9625 2.3717 2.4301 2.9978 1.2651 1.1870 1.1190 1.0589 3.1013 3.3408 2.5607 2.8047 2.6669 2.8640 3.4003 4.7341 4.3213 3.7248 3.8810 3.6972 2.5608 3.6169 2.9407 4.3807 1.4914 5.3060 2.3734 3.2774 1.3808 2.0261 2.6619 1.1700 1.1704 1.5214 1.4549 1.3698 1.3535 2.6672 1.3330 4.0892 1.8077 1.8934 1.4233 2.6112 2.6157 1.6994 1.7835 1.2238 1.9148 1.3627 1.5592 2.9220 1.9367 1.3207 1.3222 2.1168 1.4169 3.4763 1.1919 1.1918 1.7517 1.2471 1.3114 2.7850 2.8028 2.3168 1.0454 1.0453 1.0510 1.0510 1.0467 1.0470 1.0657 1.1140 3.7147 5.1078 7.5584 6.1674 1.0348 1.0348 1.0352 1.0352 1.0832 1.0832 1.1001 1.1001 1.0991 1.0990 1.1005 1.1004 1.0991 1.0991 1.0861 1.0846 1.0949 1.0881 1.0932 1.0994
irintensity: 0.0000 0.0315 0.3211 0.0000 0.4497 0.0000 2.2022 0.0026 0.5223 0.0000 0.0382 0.0032 0.5031 0.2780 0.0004 1.2925 0.1512 11.9608 0.0000 2.9555 1.1858 0.0000 2.0596 1.1382 1.3361 0.0000 2.4784 2.5452 83.1689 0.0000 0.0000 0.2517 33.5628 0.0000 0.8653 0.0000 3.0973 0.0000 0.6257 0.3059 0.0000 7.7095 0.0000 16.8109 11.5302 1.2226 45.7066 0.0000 5.0332 0.5380 3.4825 1.4374 4.7804 2.5164 13.5433 0.3116 3.3599 2.2348 0.0026 0.4246 5.0376 1.5113 0.0003 31.8871 6.5441 25.0167 11.5866 1.3855 8.6523 0.4431 0.0000 2.7737 0.0000 9.2197 0.2405 32.5573 1.3798 28.8125 7.6288 7.4989 0.2186 0.0383 0.0006 63.9500 63.8870 28.0663 0.4235 9.3979 0.0003 0.3411 189.9033 3.1228 0.0054 44.5363 0.0680 88.0321 20.1398 0.3821 29.2549 10.9814 45.3747 30.9188
temp: 298.150 k
press: 1.00000 atm
elementType: 6 6 6 6 6 6 6 6 6 6 6 6 6 6 6 6 1 1 1 1 1 1 1 1 1 1 1 1 1 1 1 1 1 1 1 1
symmnumber: 1
zpe: 815360.1 jmol-1
zpe.correction: 0.310554 hartree
zpe.thermalcorrener: 0.324845 hartree
zpe.thermalcorrenthalpy: 0.325790 hartree
zpe.thermalcorrgfe: 0.270630 hartree
zpe.sumelectzpe: -620.536785 hartree
zpe.sumelectthermal: -620.522494 hartree
zpe.sumelectthermalent: -620.521550 hartree
zpe.sumelectthermalfe: -620.576709 hartree
dipole: 0.0000 -0.1813 0.0002
dipole: 0.1813
quadrupole: -87.5666 -90.5254 -102.9122
quadrupole: 0.0000 0.0002 0.0011
quadrupole: 6.1014 3.1427 -9.2441 0.0000 0.0002 0.0011
hfenergy: -620.8473394 hartree
pointgroup: C01 [X(C16H20)]
dipole: -0.0000015 0.0713194 0.0000705 debye
polarizability: 212.2909926|0.0000215|209.733116|0.0033776|-0.0143719|107.2141672 unknown
InChI: InChI=1S/C16H20/c1-11(2)13-9-10-14(12(3)4)16-8-6-5-7-15(13)16/h5-12H,1-4H3
charge 0 multiplicity 1
36 atoms
C  1.455038 0.562861 -0.000024
C  -1.455072 0.562783 0.000097
C  2.988512 0.653744 0.000019
C  -2.98855 0.653588 0.000117
C  0.731899 -0.69172 0.00015
C  -0.731865 -0.69176 0.0002
C  0.710112 1.749848 -0.000061
C  -0.710208 1.749809 -0.000018
C  3.515982 1.358501 1.279976
C  3.516126 1.360854 -1.278564
C  -3.516158 1.359325 -1.279233
C  -3.516098 1.359663 1.279307
C  1.408088 -1.961691 0.000307
C  -1.407982 -1.96177 0.000348
C  0.713611 -3.171405 0.000469
C  -0.713437 -3.171445 0.000481
H  3.415921 -0.364292 -0.000936
H  -3.415906 -0.364472 0.000261
H  1.233249 2.713512 -0.000155
H  -1.233395 2.713446 -0.000086
H  3.164063 2.405048 1.333884
H  4.622023 1.373264 1.285905
H  3.170055 0.839135 2.191745
H  3.170022 0.843374 -2.191336
H  4.62217 1.375276 -1.28448
H  3.164597 2.407634 -1.33044
H  -3.16448 2.405997 -1.332281
H  -4.622201 1.373868 -1.285128
H  -3.170145 0.840793 -2.191443
H  -3.170011 0.841394 2.191639
H  -4.622141 1.374175 1.285269
H  -3.164448 2.40636 1.332038
H  2.501491 -1.987975 0.000312
H  -2.501383 -1.988117 0.000371
H  1.261616 -4.120168 0.000583
H  -1.261389 -4.120238 0.000603
