program: Gaussian 09
title: 000090379
version: EM64L-G09RevD.01
frameworkgroup: C1[X(C11H13BrO3)]
method: RPBEPBE
basis: SDD
operation: Freq
keyword: #p
keyword: freq=noraman
keyword: PBEPBE/SDD
title: #p freq=noraman PBEPBE/SDD
converged: YES YES NO NO
title: Mulliken charges:
elementType: Br O O O C C C C C C C C C C C H H H H H H H H H H H H H
charge: -0.011364 -0.273851 -0.273227 -0.321110 0.209840 0.297684 -0.309731 -0.326676 -0.730093 0.225126 -0.351759 -0.351816 -0.236727 -0.216143 -0.519366 0.220052 0.231169 0.215039 0.241477 0.275739 0.338710 0.278003 0.241726 0.228860 0.228201 0.247960 0.213124 0.229151
chargesum: 0.00000
title: Mulliken charges with hydrogens summed into heavy atoms:
elementType: Br O O O C C C C C C C C C C C
charge: -0.011364 -0.273851 -0.273227 -0.321110 0.209840 0.297684 0.141490 0.129840 -0.115644 0.225126 -0.073756 -0.110090 -0.007866 0.012058 0.170869
polarizability: 1.40850223e+02 -1.52572721e+01 1.36721886e+02 2.75825581e+00 1.27579001e+01 1.36941841e+02
1716.lowfreq: -12.4129 -6.6423 -0.0007 -0.0006 0.0004 5.7568 33.3536 45.3923 50.9219
frequency: 32.3795 45.3529 50.7925 83.6259 102.2244 120.7581 142.5646 168.0796 178.8489 227.3843 263.4370 265.6042 311.1869 337.2823 356.6301 462.3258 478.1241 503.1902 570.1868 581.7581 609.7192 625.8594 645.0486 696.4899 747.3290 762.3416 777.7803 815.0857 849.6903 870.9087 884.9944 916.1883 953.6647 961.1284 968.1392 978.8639 990.5527 1011.2233 1037.2793 1085.8051 1097.9082 1108.8341 1110.2714 1150.4485 1155.5694 1162.3240 1170.8863 1196.5349 1199.4232 1231.7781 1257.1815 1289.3458 1319.7676 1327.9599 1375.1848 1419.6424 1422.1047 1441.2970 1456.9354 1467.3336 1474.4387 1476.1215 1476.3163 1586.0561 1608.7805 2967.2931 2991.1998 3001.5569 3066.0055 3069.8573 3095.0553 3107.4192 3117.7223 3129.9950 3145.5172 3160.5403 3166.3697 3177.6550
redmass: 3.7600 7.7151 5.0908 2.8117 5.2352 3.5288 1.4977 1.9427 3.8937 3.5723 5.3365 3.6440 4.8980 3.8396 4.5420 3.8378 5.0618 5.7039 4.1088 4.3266 2.3762 5.9165 5.9058 5.8125 2.8080 3.5056 1.7940 2.6750 2.8157 1.9095 2.1548 3.0327 2.6215 1.6426 3.3204 3.0299 1.3312 4.4160 2.1210 1.9768 2.1361 1.2622 1.9426 1.3583 1.4200 1.2378 1.1246 2.8630 1.3027 1.2653 1.6335 2.2798 1.2931 1.2455 10.4201 1.1412 1.3377 1.7171 1.0649 1.0921 1.7461 1.0772 1.3357 7.0744 6.7262 1.0310 1.0684 1.0612 1.1031 1.0562 1.1011 1.1026 1.1021 1.0855 1.0908 1.0969 1.1103 1.0967
irintensity: 4.0761 0.9754 0.9191 7.2517 1.9986 2.8334 0.3068 2.4473 6.9419 7.8191 4.1273 1.4214 4.3392 1.6761 1.1745 3.3459 16.8164 14.7817 5.4040 9.8392 3.2189 53.9473 4.3903 32.6030 18.1341 8.7170 68.1287 4.4103 6.4726 6.9568 5.9825 51.7621 44.3617 16.7143 14.5446 13.5576 0.3833 115.0885 14.4543 33.6618 34.4509 3.1575 36.1016 1.3669 17.7399 4.4153 12.0691 89.3577 9.9098 7.7289 12.9695 91.6323 10.3398 1.5360 1.3299 3.3103 43.7156 8.4809 11.3498 4.8372 18.0713 15.1641 26.9055 15.6255 14.2611 68.7524 59.9256 61.0117 29.7271 19.5821 26.3369 25.5923 27.2394 2.3442 16.4670 18.8245 2.9471 9.9144
temp: 298.150 k
press: 1.00000 atm
elementType: 35 8 8 8 6 6 6 6 6 6 6 6 6 6 6 1 1 1 1 1 1 1 1 1 1 1 1 1
symmnumber: 1
zpe: 572104.8 jmol-1
zpe.correction: 0.217903 hartree
zpe.thermalcorrener: 0.232731 hartree
zpe.thermalcorrenthalpy: 0.233675 hartree
zpe.thermalcorrgfe: 0.174039 hartree
zpe.sumelectzpe: -664.926441 hartree
zpe.sumelectthermal: -664.911613 hartree
zpe.sumelectthermalent: -664.910669 hartree
zpe.sumelectthermalfe: -664.970305 hartree
dipole: 1.6892 4.5038 -0.3413
dipole: 4.8223
quadrupole: -89.9658 -89.2435 -92.3610
quadrupole: -9.2604 1.6609 1.0686
quadrupole: 0.5576 1.2799 -1.8376 -9.2604 1.6609 1.0686
hfenergy: -665.1443444 hartree
pointgroup: C01 [X(C11H13Br1O3)]
dipole: -0.4568191 0.7257776 -1.6923555 debye
polarizability: 154.2378809|-5.561806|143.5490423|1.5486118|-1.3277691|116.727027 unknown
InChI: InChI=1S/C11H13BrO3/c1-13-10-5-3-2-4-9(10)11(8-12)14-6-7-15-11/h2-5H,6-8H2,1H3
charge 0 multiplicity 1
28 atoms
Br -0.975939 -1.149891 2.977691
O  -1.597948 1.035131 -0.633966
O  -1.8733 -1.302477 -0.275725
O  0.893378 1.874491 0.762174
C  -1.108096 -0.137262 0.190449
C  0.375097 -0.377347 -0.060984
C  -2.516551 0.48211 -1.660112
C  -3.063242 -0.784679 -0.985824
C  -1.491846 0.260549 1.62607
C  1.323132 0.652717 0.185242
C  0.83916 -1.621956 -0.548046
C  2.696136 0.447968 -0.07623
C  2.21024 -1.832576 -0.809514
C  3.141411 -0.794417 -0.576322
C  0.915307 3.041474 -0.141051
H  -1.952203 0.239455 -2.580491
H  -3.278279 1.251602 -1.863721
H  -3.875394 -0.553015 -0.269204
H  -3.385183 -1.572984 -1.683163
H  -2.581156 0.376532 1.720178
H  -0.950182 1.169878 1.91823
H  0.107671 -2.416319 -0.717564
H  3.40523 1.253738 0.143129
H  2.550718 -2.80388 -1.183724
H  4.208294 -0.954806 -0.767519
H  0.146494 2.916289 -0.924983
H  1.914799 3.173646 -0.5987
H  0.678551 3.911029 0.491182
