program: Gaussian 09
title: 000090359
version: EM64L-G09RevD.01
frameworkgroup: C1[X(C8H4ClNO3)]
method: RPBEPBE
basis: SDD
operation: Freq
keyword: #p
keyword: freq=noraman
keyword: PBEPBE/SDD
title: #p freq=noraman PBEPBE/SDD
converged: NO NO NO NO
title: Mulliken charges:
elementType: Cl O O O N C C C C C C C C H H H H
charge: -0.025080 -0.225358 -0.221836 -0.178046 -0.432248 0.175322 0.234215 -0.280922 0.172593 -0.331565 -0.129963 -0.167050 0.188866 0.299713 0.276831 0.375089 0.269439
chargesum: 0.00000
title: Mulliken charges with hydrogens summed into heavy atoms:
elementType: Cl O O O N C C C C C C C C
charge: -0.025080 -0.225358 -0.221836 -0.178046 -0.057159 0.175322 0.234215 0.018791 0.172593 -0.054734 -0.129963 0.102389 0.188866
polarizability: 1.76672115e+02 -2.20392762e+00 1.17874832e+02 2.45519257e-03 -2.51032812e-03 4.19414768e+01
1716.lowfreq: 0.0006 0.0015 0.0022 2.6043 9.9213 16.0159 63.3787 146.6879 157.7834
frequency: 63.3738 146.6876 157.7814 161.0376 166.7991 298.5323 328.2197 338.7245 376.1562 429.4663 473.6477 491.3751 519.5943 551.7473 612.9936 659.9640 675.9526 677.5221 747.4985 775.3928 787.5018 831.6335 844.3233 887.2873 922.1227 963.3681 1063.8761 1082.5383 1139.4554 1153.7724 1219.7349 1248.3793 1283.4569 1382.2106 1392.4448 1424.7723 1452.8244 1579.4886 1613.0196 1646.1076 1715.7171 3168.4475 3172.5931 3187.6550 3517.1898
redmass: 12.7238 5.2167 9.6010 8.6710 15.5349 15.5303 7.6758 7.6050 11.8684 3.5396 8.4711 8.9454 3.6017 9.5051 6.9206 3.2060 7.5349 7.8439 2.6684 8.1921 2.0236 1.4267 5.7897 8.4370 1.4296 1.3467 1.9183 4.5693 1.4351 8.3676 3.5157 1.5338 3.5071 1.5604 11.3711 5.2604 2.6880 8.1636 7.9204 7.5579 9.2980 1.0896 1.0933 1.0977 1.0770
irintensity: 0.3041 2.1309 0.0004 10.5358 0.8268 0.0028 5.3174 0.5647 16.9522 3.4900 4.8372 20.7811 10.3338 2.3308 19.9108 4.4318 3.0642 7.6605 21.8236 12.2950 129.7210 50.4300 71.8031 44.8202 11.1905 1.4917 3.2012 35.5976 22.1752 76.9791 74.4726 2.4319 303.9024 5.4425 30.1685 174.2195 117.1535 9.5083 62.7458 302.9186 652.2004 0.4426 4.2197 0.3609 77.2129
temp: 298.150 k
press: 1.00000 atm
elementType: 17 8 8 8 7 6 6 6 6 6 6 6 6 1 1 1 1
symmnumber: 1
zpe: 283110.5 jmol-1
zpe.correction: 0.107831 hartree
zpe.thermalcorrener: 0.117913 hartree
zpe.thermalcorrenthalpy: 0.118857 hartree
zpe.thermalcorrgfe: 0.071438 hartree
zpe.sumelectzpe: -1046.860092 hartree
zpe.sumelectthermal: -1046.850011 hartree
zpe.sumelectthermalent: -1046.849067 hartree
zpe.sumelectthermalfe: -1046.896486 hartree
dipole: -1.8718 -1.2603 -0.0020
dipole: 2.2565
quadrupole: -91.8561 -83.4170 -80.8136
quadrupole: 10.9339 -0.0062 -0.0013
quadrupole: -6.4939 1.9452 4.5486 10.9339 -0.0062 -0.0013
hfenergy: -1046.9679234 hartree
pointgroup: C01 [X(C8H4Cl1N1O3)]
dipole: 0.7528982 0.4704265 -0.0009785 debye
dipolederiv: -0.7998291 0.1393903 -0.0000077 0.2096273 -0.1360919 0.0000118 -0.0000434 0.0000155 -0.0468802 -1.793955 0.055367 0.000159 -0.3717448 -0.4196683 0.0003174 -0.0003201 -0.0000048 -0.1818393 -0.5779544 -0.0241002 0.0000062 -0.0584375 -1.1486873 0.0003842 -0.0000577 0.0004889 -0.3453297 -1.4750368 0.3001413 -0.0005592 0.3159591 -0.5717874 0.0003068 0.0012359 -0.0003193 -0.3486334 -1.02875 0.4765823 -0.0002743 0.4409995 -0.9472038 0.0000141 -0.000356 0.0004269 -0.3494829 -0.5147364 -0.3277593 0.0000952 -0.2705425 -0.3590964 0.0001781 0.0000596 0.0000886 -0.0149457 1.0942878 -0.2233476 0.0001239 -0.0891896 0.1949723 -0.0000952 0.0001507 -0.0001321 0.103075 -0.1539304 0.2290984 -0.0000596 -0.044659 0.0188894 0.0000087 0.0000554 -0.0000044 -0.0403286 1.5502394 -0.0921744 0.0001596 0.1508371 1.5014021 -0.0006157 0.0000581 -0.0005873 0.2800171 -0.3205262 0.0380018 -0.0000146 -0.0705333 0.0972708 -0.0000626 -0.0001315 -0.0000108 -0.1444053 1.2072672 -0.3393309 0.0000443 -0.3986868 -0.0545042 0.0000274 0.0000677 0.0000099 -0.086555 -0.147131 0.0233906 0.0000068 0.1220184 0.1033608 -0.0000361 0.0000301 -0.0000153 -0.0726554 2.5148234 -0.2812634 0.0003389 -0.0037899 1.4010819 -0.0006305 -0.0007434 -0.0002054 0.3909021 0.1221747 -0.0051915 0.0000022 0.0439273 0.065837 0.0000114 -0.0000148 0.0000243 0.1634792 0.0808054 0.0418029 -0.0000056 0.0240213 0.0096552 0.000043 -0.0000323 0.0000548 0.1794041 0.214612 0.056077 -0.0000302 0.0534936 0.1839949 0.0001204 0.000025 0.0001783 0.3514079 0.0276395 -0.0666842 0.0000152 -0.0533002 0.0605749 0.0000169 0.0000169 -0.0000079 0.1627702 unknown
polarizability: 176.4535232|-4.2026336|118.0934165|-0.0067095|-0.0231049|41.9414842 unknown
InChI: InChI=1S/C8H4ClNO3/c9-4-1-2-6-5(3-4)7(11)10-8(12)13-6/h1-3,10H
charge 0 multiplicity 1
17 atoms
Cl 4.285997 -0.495451 -0.000038
O  -1.434775 1.373665 -0.000542
O  -0.796819 -2.732051 0.001346
O  -3.698184 0.92853 0.00032
N  -2.210624 -0.880003 0.000239
C  0.184571 -0.496816 -0.00001
C  -0.107052 0.88942 -0.0003
C  1.533445 -0.928272 0.000086
C  -0.921613 -1.479945 0.000516
C  0.919366 1.854212 -0.000446
C  2.549817 0.036547 -0.000138
C  2.260154 1.42264 -0.000399
C  -2.541804 0.484921 -0.00087
H  1.742066 -2.002218 0.000332
H  0.663174 2.916696 -0.000678
H  -3.010999 -1.52173 0.000907
H  3.07428 2.152956 -0.000525
