program: Gaussian 09
title: 000090390
version: EM64L-G09RevD.01
frameworkgroup: C1[X(C16H20)]
method: RPBEPBE
basis: SDD
operation: Freq
keyword: #p
keyword: freq=noraman
keyword: PBEPBE/SDD
title: #p freq=noraman PBEPBE/SDD
converged: YES YES NO NO
title: Mulliken charges:
elementType: C C C C C C C C C C C C C C C C H H H H H H H H H H H H H H H H H H H H
charge: -0.018519 0.427422 0.428992 -0.249293 -0.244743 0.424186 -0.395895 -0.458182 -0.719277 -0.719320 -0.730641 -0.730760 -0.461676 -0.465582 -0.306356 -0.267323 0.229400 0.204264 0.223073 0.222630 0.213517 0.213411 0.225261 0.225289 0.213425 0.213511 0.244232 0.213404 0.227961 0.227963 0.213400 0.244311 0.238082 0.238148 0.226925 0.228760
chargesum: 0.00000
title: Mulliken charges with hydrogens summed into heavy atoms:
elementType: C C C C C C C C C C C C C C C C
charge: -0.018519 0.427422 0.428992 -0.019894 -0.040479 0.424186 -0.172822 -0.235552 -0.067088 -0.067095 -0.045045 -0.045086 -0.223593 -0.227434 -0.079431 -0.038563
polarizability: 2.08681337e+02 7.47963932e+00 2.09594593e+02 9.22002389e-03 1.34009350e-02 1.05704129e+02
1716.lowfreq: -15.0829 -10.8296 -6.4574 -0.0007 -0.0004 0.0002 15.9356 84.8151 107.7506
frequency: -9.1774 84.6423 107.7199 119.8605 148.1039 157.3063 166.7256 181.9261 212.9125 222.8297 228.8333 240.4767 266.3968 302.3109 310.3559 355.7936 388.7530 434.4432 473.7843 479.3799 500.9893 526.6976 534.4571 570.0216 619.0787 631.8727 670.2225 750.9209 771.3582 781.1380 784.5008 840.3874 852.6119 880.6980 900.7453 914.8893 922.2904 927.7944 937.9530 953.6665 965.0150 975.3644 987.2204 1009.1797 1035.3719 1095.5066 1099.1400 1116.3798 1128.3961 1132.6995 1153.9418 1165.8651 1178.5268 1193.9697 1231.4636 1240.8272 1256.7282 1292.2909 1315.0028 1320.8993 1336.4042 1375.4006 1377.1414 1383.4977 1392.3022 1396.3529 1400.8605 1412.2259 1430.7286 1453.2674 1465.2745 1466.4961 1474.8791 1475.0656 1481.7387 1486.5083 1486.7809 1500.1524 1523.0034 1582.6388 1612.8289 1619.1371 2970.9956 2971.4605 2974.7146 2981.7132 2986.8775 3063.9600 3064.4579 3067.1452 3068.4285 3072.5370 3074.5141 3107.4516 3110.8230 3113.6551 3118.0298 3124.3467 3127.6500 3154.4540 3156.2715 3180.7408
redmass: 3.6394 2.2514 3.3173 1.4026 2.9292 1.1151 2.6550 2.0041 1.6514 1.9548 2.1640 1.1585 2.4841 2.8573 3.2299 3.5733 2.7128 3.3088 4.4140 3.2919 3.8665 3.5567 5.5356 3.2635 2.8661 3.6957 2.7452 4.1676 1.3030 5.4396 1.6671 3.3140 2.9543 2.6869 1.3637 1.2189 1.3944 1.3748 2.6564 1.4414 1.2806 1.3550 1.4009 4.1072 1.6233 2.0768 1.8883 2.8830 3.1382 1.6949 1.5012 1.7736 1.2447 1.7615 1.6510 2.2828 2.2548 1.7527 2.4634 1.2406 1.2092 3.1647 1.1913 2.5483 1.1672 1.2104 1.2273 1.4939 1.8804 2.0108 1.0480 1.0503 1.0505 1.0541 1.0448 1.0500 1.0709 1.0571 4.7893 6.0400 5.9214 5.9081 1.0766 1.0351 1.0356 1.0385 1.0446 1.0997 1.0994 1.0988 1.0984 1.0998 1.0986 1.0958 1.0934 1.0888 1.0854 1.0899 1.0903 1.1001 1.0998 1.0809
irintensity: 0.0106 0.0049 0.4103 0.4408 0.1943 0.0113 0.3010 2.0191 0.0021 0.1693 0.9789 0.0031 0.0816 0.5520 0.3169 8.8146 0.7437 0.1934 0.1308 0.5983 0.7836 0.0002 1.0695 0.7714 1.4721 1.1881 0.0024 4.5542 0.5244 0.1851 86.4132 1.5977 37.0111 1.4440 0.3948 6.5662 0.8700 0.2072 10.3471 0.0267 0.0169 0.1028 2.5589 12.3241 10.4688 6.7062 20.2914 0.8571 4.7110 6.4708 1.2264 5.6862 12.0510 6.8293 1.6764 2.1457 1.9328 7.7659 5.4266 1.9732 0.9210 2.6886 19.6581 3.5244 16.9812 15.2865 12.3139 7.4226 0.6974 0.1142 5.0349 3.4639 0.1472 25.7204 0.5874 0.2254 16.6774 1.3170 1.7340 14.4442 1.9787 0.5377 15.5800 33.9064 36.5672 36.3606 61.1054 0.8428 18.7282 0.9346 116.3396 14.2112 43.1290 0.1720 22.9979 42.1253 1.2802 12.9080 31.5012 49.5649 26.0031 9.7751
temp: 298.150 k
press: 1.00000 atm
elementType: 6 6 6 6 6 6 6 6 6 6 6 6 6 6 6 6 1 1 1 1 1 1 1 1 1 1 1 1 1 1 1 1 1 1 1 1
symmnumber: 1
zpe: 817477.4 jmol-1
zpe.correction: 0.311361 hartree
zpe.thermalcorrener: 0.326311 hartree
zpe.thermalcorrenthalpy: 0.327255 hartree
zpe.thermalcorrgfe: 0.271134 hartree
zpe.sumelectzpe: -620.514945 hartree
zpe.sumelectthermal: -620.499995 hartree
zpe.sumelectthermalent: -620.499051 hartree
zpe.sumelectthermalfe: -620.555171 hartree
dipole: -0.5305 0.4985 0.0008
dipole: 0.7280
quadrupole: -90.2801 -88.8071 -103.0172
quadrupole: -0.1589 0.0026 -0.0014
quadrupole: 3.7547 5.2277 -8.9824 -0.1589 0.0026 -0.0014
hfenergy: -620.8263056 hartree
pointgroup: C01 [X(C16H20)]
dipole: 0.2219114 -0.1810495 0.0003227 debye
polarizability: 207.641883|7.3426912|210.6340226|-0.0282084|-0.0464305|105.7041528 unknown
InChI: InChI=1S/C16H20/c1-11(2)14-9-5-7-13-8-6-10-15(12(3)4)16(13)14/h5-12H,1-4H3
charge 0 multiplicity 1
36 atoms
C  -0.436637 0.08923 -0.000451
C  0.684078 1.031787 -0.000749
C  -0.393022 -1.38491 0.000046
C  2.179746 0.67167 0.000028
C  0.820553 -2.356143 -0.00065
C  -1.77818 0.69893 -0.000351
C  0.430097 2.416281 -0.001035
C  -1.616253 -2.088021 0.00118
C  2.895809 1.191046 1.277722
C  2.897332 1.19109 -1.276854
C  1.651486 -2.38074 1.317049
C  1.652885 -2.379145 -1.317575
C  -1.961939 2.119385 -0.001047
C  -2.972559 -0.093134 0.000696
C  -0.871407 2.979175 -0.001362
C  -2.899699 -1.477092 0.001678
H  2.284717 -0.414682 0.000124
H  0.342094 -3.355665 -0.001489
H  1.286168 3.100162 -0.000819
H  -1.578982 -3.184033 0.001576
H  2.897242 2.295227 1.323498
H  3.949406 0.853064 1.292434
H  2.399402 0.821678 2.193858
H  2.401776 0.822127 -2.193596
H  3.950854 0.852853 -1.290594
H  2.89913 2.295274 -1.322335
H  2.201709 -1.45402 1.537356
H  2.38814 -3.205689 1.272303
H  0.97916 -2.572919 2.173431
H  0.981532 -2.569883 -2.175035
H  2.389113 -3.20448 -1.273082
H  2.203936 -1.452556 -1.536016
H  -2.986759 2.50899 -0.001041
H  -3.939564 0.423526 0.000771
H  -1.004311 4.066185 -0.001736
H  -3.802353 -2.097071 0.002665
