program: Gaussian 09
title: 000090370
version: EM64L-G09RevD.01
frameworkgroup: C1[X(C9H11Br2NO3S)]
method: RPBEPBE
basis: SDD
operation: Freq
keyword: #p
keyword: freq=noraman
keyword: PBEPBE/SDD
title: #p freq=noraman PBEPBE/SDD
converged: YES YES NO NO
title: Mulliken charges:
elementType: Br Br S O O O N C C C C C C C C C H H H H H H H H H H H
charge: 0.120631 0.133270 0.257849 -0.153338 -0.266062 -0.202289 -0.120471 -0.166033 -0.359086 -0.097124 -0.620467 0.282180 -0.655335 -0.688074 0.233787 -0.499613 0.338957 0.291197 0.242246 0.222114 0.254165 0.244138 0.242063 0.230886 0.238833 0.241523 0.254053
chargesum: 0.00000
title: Mulliken charges with hydrogens summed into heavy atoms:
elementType: Br Br S O O O N C C C C C C C C C
charge: 0.120631 0.133270 0.257849 -0.153338 -0.266062 -0.202289 -0.120471 -0.166033 -0.020129 0.194073 -0.620467 0.282180 0.063189 0.029014 0.233787 0.234796
polarizability: 2.02901744e+02 5.02573326e+00 1.58917889e+02 2.52166054e+00 6.77711249e+00 1.27141670e+02
1716.lowfreq: -9.4862 0.0009 0.0010 0.0019 4.0441 9.1838 22.2623 42.6481 43.8939
frequency: 22.2308 42.5957 43.8736 75.7592 93.1994 102.8832 108.5762 125.1974 137.7473 158.6200 187.0896 212.4983 219.5978 223.2106 237.2142 242.8057 279.3812 286.0792 312.5215 336.9297 358.0556 402.7023 462.3432 491.2372 538.6251 557.5395 614.3088 657.7473 687.1003 716.4456 749.9195 795.9487 825.5583 839.2450 868.7124 929.0464 939.4569 954.6177 990.5825 996.2339 1006.2586 1069.3300 1114.6496 1120.0406 1124.2405 1150.4623 1167.5367 1193.4703 1200.3713 1209.5109 1273.9642 1286.6539 1343.4044 1383.5172 1401.5897 1423.1532 1453.3019 1456.4747 1460.0332 1463.5279 1475.2965 1478.2615 1661.6176 1748.7837 2980.3373 2987.2597 3008.9440 3029.6040 3075.4928 3084.5050 3095.9336 3102.1958 3106.9661 3113.5009 3156.2861
redmass: 6.8205 5.9382 5.6997 4.9160 1.3064 10.6712 3.7409 8.8783 13.3389 8.3474 6.6699 3.5344 8.2793 2.2650 2.2895 1.9333 1.5748 1.9741 6.5406 3.9329 3.8195 4.7747 6.7255 5.3420 4.6460 9.9097 7.5543 5.6090 9.1142 5.0796 9.2145 6.9542 4.2015 6.3740 5.9528 4.8609 1.5342 2.8244 4.4022 6.1157 1.3728 3.6187 1.2727 3.5142 1.8091 1.4430 2.1197 1.6760 2.1994 1.4317 1.7487 6.5378 1.3621 1.1960 1.1926 1.1746 1.0493 1.0510 1.0471 1.0500 1.0501 1.0496 9.5255 12.8160 1.0387 1.0359 1.0295 1.0844 1.0959 1.0990 1.1008 1.0898 1.1003 1.1048 1.1053
irintensity: 0.3770 0.3605 1.8618 0.5345 0.5291 0.6901 0.6941 1.1770 0.3719 1.3033 5.9869 3.2313 0.7591 4.5655 1.9007 3.5917 2.1156 2.3420 11.8039 0.8920 3.9320 9.1619 4.0158 6.3076 7.6657 80.9813 18.5290 29.2785 15.4596 9.5275 28.1675 35.6919 9.1708 3.2022 3.2923 16.5595 2.7321 14.9852 9.5740 5.9500 1.4873 81.5549 1.2590 288.1367 34.1867 13.9702 53.1672 16.0539 35.0219 15.1880 42.8574 122.9563 22.5068 29.2527 15.6959 17.6696 12.8138 1.7296 10.5177 8.9743 16.0765 11.1480 141.4638 389.2090 19.3290 17.2176 29.7347 3.6891 14.7770 14.8097 13.1476 4.6754 17.0939 20.1276 12.0880
temp: 298.150 k
press: 1.00000 atm
elementType: 35 35 16 8 8 8 7 6 6 6 6 6 6 6 6 6 1 1 1 1 1 1 1 1 1 1 1
symmnumber: 1
zpe: 497825.4 jmol-1
zpe.correction: 0.189612 hartree
zpe.thermalcorrener: 0.207778 hartree
zpe.thermalcorrenthalpy: 0.208722 hartree
zpe.thermalcorrgfe: 0.140723 hartree
zpe.sumelectzpe: -1053.708144 hartree
zpe.sumelectthermal: -1053.689978 hartree
zpe.sumelectthermalent: -1053.689034 hartree
zpe.sumelectthermalfe: -1053.757032 hartree
dipole: 5.6023 2.2228 -1.6960
dipole: 6.2612
quadrupole: -97.3765 -123.4641 -124.9387
quadrupole: 0.1038 4.8870 1.5332
quadrupole: 17.8832 -8.2044 -9.6789 0.1038 4.8870 1.5332
hfenergy: -1053.8977558 hartree
pointgroup: C01 [X(C9H11Br2N1O3S1)]
dipole: -2.1778137 1.1239243 0.2491482 debye
polarizability: 202.4624328|-4.9365798|150.0692469|5.0838914|-16.1062137|136.4296234 unknown
InChI: InChI=1S/C9H11Br2NO3S/c1-8(2)4(5(13)15-3)12-6(14)9(10,11)7(12)16-8/h4,7H,1-3H3
charge 0 multiplicity 1
27 atoms
Br 3.70681 -1.249614 1.468151
Br 3.860537 0.850414 -1.060824
S  0.889045 2.26287 0.127092
O  1.575308 -1.882999 -1.557908
O  -3.017776 -0.735361 -0.623224
O  -1.863669 -1.472385 1.267546
N  0.547397 -0.389022 0.063785
C  -0.941082 1.576736 0.02955
C  1.434074 0.570162 0.776582
C  -0.776211 0.046694 -0.383263
C  2.654372 -0.189239 0.125777
C  1.576971 -1.037231 -0.656402
C  -1.596647 1.752814 1.415516
C  -1.685143 2.363823 -1.062749
C  -1.900871 -0.816293 0.209557
C  -4.206976 -1.508896 -0.179069
H  1.400085 0.536834 1.873701
H  -0.8319 -0.038697 -1.484294
H  -1.565726 2.815057 1.70878
H  -2.657417 1.436554 1.386001
H  -1.086735 1.162128 2.195721
H  -1.151035 2.318104 -2.027517
H  -2.6958 1.9376 -1.202133
H  -1.795759 3.424095 -0.775478
H  -4.966298 -1.322163 -0.950471
H  -4.543854 -1.155468 0.809911
H  -3.9546 -2.580018 -0.117537
