program: Gaussian 09
title: 000090356
version: EM64L-G09RevD.01
frameworkgroup: C1[X(C10H11BrO)]
method: RPBEPBE
basis: SDD
operation: Freq
keyword: #p
keyword: freq=noraman
keyword: PBEPBE/SDD
title: #p freq=noraman PBEPBE/SDD
converged: YES YES NO NO
title: Mulliken charges:
elementType: Br O C C C C C C C C C C H H H H H H H H H H H
charge: -0.037486 -0.213125 -0.512311 -0.318925 0.121453 0.285103 -0.686149 -0.341135 -0.342739 -0.244532 -0.227691 -0.221853 0.235713 0.235841 0.249081 0.249911 0.271565 0.271618 0.243203 0.279030 0.232103 0.235818 0.235507
chargesum: 0.00000
title: Mulliken charges with hydrogens summed into heavy atoms:
elementType: Br O C C C C C C C C C C
charge: -0.037486 -0.213125 -0.040757 0.180067 0.121453 0.285103 -0.142966 -0.097933 -0.063709 -0.012429 0.008127 0.013654
polarizability: 1.98209794e+02 -1.37956756e+01 1.18276289e+02 8.16689584e-02 -1.00041167e-02 5.92613398e+01
1716.lowfreq: -11.6628 -0.0003 0.0004 0.0005 1.4297 3.9142 26.5994 42.1191 60.7651
frequency: 25.8455 41.1187 60.7598 68.6707 117.4744 134.5309 160.5335 226.5739 302.8204 363.0414 400.1898 415.1340 468.4169 568.6777 603.2176 613.9340 652.6512 696.3578 735.3950 768.2508 781.7278 837.9448 858.8824 943.8801 967.7384 989.6659 992.0546 1005.9325 1014.1834 1025.8641 1059.3553 1065.1956 1087.0745 1106.8464 1174.1473 1186.8297 1199.6037 1234.3653 1245.3967 1283.2819 1294.5529 1316.1866 1346.2371 1388.3586 1432.9096 1437.3172 1449.8253 1469.8923 1479.7258 1572.0686 1599.7756 1613.6910 2962.4053 3011.5750 3027.5014 3043.7682 3085.5531 3128.4578 3129.5706 3138.0904 3149.2878 3159.1804 3170.0635
redmass: 4.7386 2.2090 6.3948 3.8249 2.4816 10.7183 3.6101 4.9537 5.4925 5.7619 2.8102 3.2263 5.9895 2.2929 5.3480 6.4349 6.4955 1.8336 1.1590 1.5368 5.5692 1.5161 1.2496 1.3851 5.3203 6.2545 1.3792 1.4022 1.3595 2.1955 3.2101 3.0149 1.6276 1.2187 1.0736 1.1426 1.4910 1.5792 1.2877 1.0789 1.6815 1.3472 1.6197 9.2237 1.1967 1.9456 1.1001 1.0955 2.1940 6.7782 6.8657 6.6263 1.0594 1.0986 1.0609 1.0561 1.1038 1.1106 1.0851 1.0881 1.0926 1.0961 1.1014
irintensity: 0.1418 1.3773 0.0945 3.6677 0.3074 0.2381 0.2848 1.8852 21.8531 5.0433 0.0678 1.1461 16.0035 5.5107 33.7661 1.4374 0.0597 46.7993 44.9595 32.8511 4.1786 1.7285 0.4441 2.8879 66.6072 4.0648 0.6383 1.8082 0.0297 2.1365 2.2375 1.9051 9.6434 1.2717 5.7097 40.4115 46.5973 24.2044 0.4436 0.4225 218.2585 18.0177 19.5306 2.5884 5.7632 27.4970 4.0106 12.7763 0.7128 80.6489 43.6038 14.0874 26.8272 9.6761 1.7035 24.0194 6.9505 20.0258 0.7070 5.0864 18.9359 18.3111 23.0647
temp: 298.150 k
press: 1.00000 atm
elementType: 35 8 6 6 6 6 6 6 6 6 6 6 1 1 1 1 1 1 1 1 1 1 1
symmnumber: 1
zpe: 477845.7 jmol-1
zpe.correction: 0.182002 hartree
zpe.thermalcorrener: 0.194005 hartree
zpe.thermalcorrenthalpy: 0.194949 hartree
zpe.thermalcorrgfe: 0.140377 hartree
zpe.sumelectzpe: -475.467373 hartree
zpe.sumelectthermal: -475.455370 hartree
zpe.sumelectthermalent: -475.454426 hartree
zpe.sumelectthermalfe: -475.508998 hartree
dipole: 4.2699 -3.6095 0.0077
dipole: 5.5912
quadrupole: -78.2634 -79.7040 -82.7530
quadrupole: -1.1529 -0.0128 0.0002
quadrupole: 1.9767 0.5361 -2.5129 -1.1529 -0.0128 0.0002
hfenergy: -475.6493746 hartree
pointgroup: C01 [X(C10H11Br1O1)]
dipole: -1.6870647 1.4115711 0.0093484 debye
dipolederiv: -0.7288438 0.0081763 -0.000734 0.1510244 -0.1679047 -0.0001269 0.0016087 -0.0002927 -0.151384 -0.8314291 0.115778 -0.0000747 0.2444165 -0.8118513 -0.0030171 -0.0001342 -0.0030543 -0.2924325 -0.4266857 -0.1549455 -0.0025061 -0.626393 -0.1722645 -0.0045981 -0.0093349 -0.0035663 0.1746601 -0.1630291 -0.0122817 -0.000853 0.1377352 0.0108032 -0.0009403 0.0029615 -0.0009838 0.1017711 1.7741669 -0.1293051 0.0023521 0.0721502 0.8763658 0.0055654 0.0042248 0.0049518 0.11414 -0.8233233 0.1447581 -0.0006002 0.0327453 -0.1055256 -0.0004755 -0.0008991 -0.0001867 -0.0176704 0.9957275 -0.1414721 -0.0011208 -0.1835022 0.172341 0.0001833 -0.0014402 0.000033 0.1403426 0.1247331 0.0712755 0.0009428 -0.120735 0.0085778 0.0006899 -0.0001689 0.0008354 -0.132533 0.0152024 -0.1429115 -0.0005948 0.1398783 0.0332592 0.0009163 0.0009615 0.0004755 -0.101994 -0.2514085 -0.0728094 -0.0006763 -0.1420092 0.1320586 0.0012071 -0.0010111 0.0014201 -0.1549273 -0.009796 0.2000232 0.0012701 0.1891065 -0.0375918 0.0008624 0.0012429 0.0009222 -0.1533532 0.1367331 -0.0368963 0.0002342 -0.0042602 0.0321477 0.0009497 0.0004267 0.0007842 -0.1330741 0.0482457 0.0143637 0.0339081 0.0655119 0.0159735 -0.0851793 0.0544153 -0.0954692 -0.0274331 0.0475352 0.0157188 -0.0339467 0.067083 0.0119041 0.0864241 -0.0528985 0.0964727 -0.0231317 0.0779954 0.0047999 0.0108834 0.0088536 0.0232135 -0.0819028 0.0110841 -0.0753063 -0.035217 0.0803584 0.0042992 -0.0100289 0.0102863 0.0184872 0.0832448 -0.0106557 0.0762799 -0.0285342 -0.0608246 0.081923 -0.0423316 0.031964 -0.0148264 0.0881429 0.0016864 0.1008136 -0.0205727 -0.0605948 0.0806568 0.0452406 0.0325133 -0.0078719 -0.087592 -0.0004643 -0.0999428 -0.0274175 0.0107623 -0.1081552 -0.0007869 -0.1273353 0.0143267 -0.0008984 -0.0007913 -0.0007962 0.139939 0.1396769 0.0513928 0.0002355 0.0020788 -0.0017052 -0.0008126 -0.0000402 -0.0007398 0.1528939 0.059449 0.0429296 0.0000555 0.070083 -0.1043727 -0.0012849 0.0002115 -0.0013306 0.1597316 -0.0440652 -0.092795 -0.0008039 -0.1083541 -0.0051316 -0.0010199 -0.0009086 -0.000985 0.1585607 -0.1105858 0.0554768 -0.0000646 0.057159 0.0795874 -0.0003383 -0.0000762 -0.0003346 0.1576357 unknown
polarizability: 198.3467038|-13.3928209|118.1368925|0.0728777|0.3721959|59.2638271 unknown
InChI: InChI=1S/C10H11BrO/c11-8-4-7-10(12)9-5-2-1-3-6-9/h1-3,5-6H,4,7-8H2
charge 0 multiplicity 1
23 atoms
Br 5.784214 0.072454 0.011058
O  0.598343 -1.86304 -0.008584
C  1.434166 0.427332 0.007778
C  2.844061 -0.204015 0.000232
C  0.318532 -0.62929 -0.001759
C  -1.112189 -0.165834 -0.001602
C  3.916865 0.88517 0.02258
C  -1.473275 1.209072 0.005305
C  -2.137973 -1.150858 -0.008465
C  -2.832492 1.588899 0.005141
C  -3.494016 -0.771171 -0.008537
C  -3.844953 0.601025 -0.001801
H  1.29999 1.072409 0.900984
H  1.299059 1.091646 -0.870875
H  2.960671 -0.840595 -0.893976
H  2.955642 -0.872522 0.871415
H  3.89467 1.531507 -0.869466
H  3.890878 1.497518 0.938176
H  -0.70172 1.986282 0.010818
H  -1.839585 -2.20454 -0.013638
H  -3.104009 2.650116 0.010369
H  -4.277394 -1.536699 -0.013808
H  -4.899683 0.898033 -0.001947
