program: Gaussian 09
title: 000090361
version: EM64L-G09RevD.01
frameworkgroup: C1[X(C17H8Cl2O)]
method: RPBEPBE
basis: SDD
operation: Freq
keyword: #p
keyword: freq=noraman
keyword: PBEPBE/SDD
title: #p freq=noraman PBEPBE/SDD
converged: NO NO NO NO
title: Mulliken charges:
elementType: Cl Cl O C C C C C C C C C C C C C C C C C H H H H H H H H
charge: -0.023686 -0.040920 -0.184733 0.063176 0.376542 0.310073 0.285315 0.225053 0.571407 -0.428546 -0.427566 -0.438459 -0.433343 -0.388153 -0.349839 -0.371574 -0.250449 -0.247386 -0.236824 -0.124037 0.233632 0.300899 0.266766 0.230312 0.317101 0.237297 0.267575 0.260366
chargesum: 0.00000
title: Mulliken charges with hydrogens summed into heavy atoms:
elementType: Cl Cl O C C C C C C C C C C C C C C C C C
charge: -0.023686 -0.040920 -0.184733 0.063176 0.376542 0.310073 0.285315 0.225053 0.571407 -0.428546 -0.193934 -0.137560 -0.166577 -0.388153 -0.119526 -0.054473 -0.013153 0.020189 0.023542 -0.124037
polarizability: 3.76802017e+02 1.06936610e+01 2.35288430e+02 2.68534973e-03 5.66863415e-03 7.31911141e+01
1716.lowfreq: -0.0014 -0.0013 -0.0007 5.9571 11.8829 19.2065 36.3320 69.1089 92.6053
frequency: 36.3213 69.1076 92.6017 130.8594 148.8663 169.8237 196.1698 201.1639 252.7200 287.6220 292.6827 322.9648 351.0752 389.6092 405.3902 429.3328 450.8090 454.1762 473.3147 490.8783 541.4589 551.3530 566.0906 595.8695 635.3452 660.9009 663.7118 682.9133 710.4175 763.1716 787.3837 800.2341 816.6468 827.0374 856.0825 892.7030 908.9643 935.4851 954.1555 959.2605 965.8076 995.0027 999.7981 1037.3504 1066.0123 1089.4496 1109.7476 1126.1908 1161.5859 1186.3862 1204.5496 1218.2704 1255.2759 1287.6010 1307.4513 1353.0259 1366.1521 1387.7608 1400.5094 1409.5228 1426.5765 1449.3110 1480.4979 1511.4953 1530.8858 1565.6478 1575.6598 1587.0154 1605.7944 1619.8944 3141.6849 3150.3331 3153.8668 3161.5769 3165.8913 3172.5502 3174.3684 3175.7224
redmass: 15.5915 5.4630 9.6494 15.1345 5.9425 4.1301 5.5061 14.1175 13.6305 8.6700 5.9699 5.0996 8.2309 8.5251 8.2144 3.3018 6.1766 4.3719 4.1486 8.5918 6.6449 3.9211 7.4545 3.8504 6.8438 4.3863 7.3204 8.6994 3.1333 2.6460 5.5941 6.9374 1.7776 1.5068 1.5648 6.4470 1.9224 1.4751 7.2846 2.0411 1.3790 1.3567 1.6404 4.3699 2.7865 1.9940 2.3065 2.2968 1.3918 1.8414 1.4685 1.5992 1.4777 3.4814 1.9519 2.8956 4.9120 5.6887 6.0953 3.3337 6.5591 2.4815 2.9160 5.4319 8.8367 7.8904 7.2866 5.8524 7.3437 7.5695 1.0868 1.0883 1.0897 1.0906 1.0926 1.0970 1.0965 1.0976
irintensity: 0.1616 0.8746 2.1873 0.1630 0.1374 0.5035 4.5090 1.5771 0.6017 0.4139 2.1758 1.9062 2.9218 10.0021 22.9909 0.8557 2.8192 0.8342 0.9872 11.8887 15.6372 13.0756 2.5946 3.0318 19.5306 0.8831 2.5920 1.0101 0.0001 8.8709 11.0477 83.6106 53.3059 66.7854 23.3750 24.2533 0.0961 2.2668 13.6820 10.1202 2.2330 0.4163 6.1171 4.1655 9.6077 35.0722 37.4135 0.4399 11.8468 30.5130 6.1918 2.5554 25.9899 154.6822 15.7151 121.8930 9.7953 5.4205 18.8561 58.4155 13.5470 16.7109 43.4371 47.7564 198.5669 29.4023 49.3902 34.0715 9.4813 16.2815 12.0901 0.0823 0.1741 3.5704 4.1724 2.4902 7.0237 19.1795
temp: 298.150 k
press: 1.00000 atm
elementType: 17 17 8 6 6 6 6 6 6 6 6 6 6 6 6 6 6 6 6 6 1 1 1 1 1 1 1 1
symmnumber: 1
zpe: 510392.1 jmol-1
zpe.correction: 0.194398 hartree
zpe.thermalcorrener: 0.209194 hartree
zpe.thermalcorrenthalpy: 0.210138 hartree
zpe.thermalcorrgfe: 0.151884 hartree
zpe.sumelectzpe: -1646.669831 hartree
zpe.sumelectthermal: -1646.655035 hartree
zpe.sumelectthermalent: -1646.654091 hartree
zpe.sumelectthermalfe: -1646.712345 hartree
dipole: 2.0413 4.1612 0.0003
dipole: 4.6349
quadrupole: -132.7726 -117.7043 -132.1610
quadrupole: -8.6272 -0.0006 0.0001
quadrupole: -5.2266 9.8416 -4.6150 -8.6272 -0.0006 0.0001
hfenergy: -1646.8642289 hartree
pointgroup: C01 [X(C17H8Cl2O1)]
dipole: -0.7806436 1.6479674 -0.0001222 debye
polarizability: 376.4832641|-12.6238152|235.6071833|0.0026076|-0.0057048|73.1911141 unknown
InChI: InChI=1S/C17H8Cl2O/c18-9-4-5-10-11-2-1-3-12-15(19)7-6-13(16(11)12)17(20)14(10)8-9/h1-8H
charge 0 multiplicity 1
28 atoms
Cl -5.275276 -0.193414 -0.000042
Cl 5.793752 -0.470664 0.000069
O  1.0053 -2.921609 0.000146
C  -1.131818 0.117433 -0.000014
C  -0.128127 1.156276 -0.000038
C  -0.762655 -1.273085 0.000019
C  1.303068 0.779611 -0.000037
C  1.684203 -0.60012 -0.000021
C  -2.537713 0.479807 -0.000045
C  0.665885 -1.691009 0.000069
C  -0.547606 2.500338 -0.000108
C  -1.754458 -2.269659 0.00004
C  -2.911095 1.861827 -0.000088
C  -3.497123 -0.587911 -0.000011
C  2.345356 1.750223 -0.000056
C  3.050145 -0.982081 -0.000025
C  -1.925459 2.850229 -0.00013
C  -3.131172 -1.935085 0.000029
C  3.701221 1.379571 -0.000052
C  4.038483 0.006494 -0.000025
H  0.188972 3.308855 -0.000148
H  -1.431938 -3.315863 0.000072
H  -3.972373 2.125954 -0.000106
H  2.109524 2.818139 -0.000094
H  3.288526 -2.04982 -0.000017
H  -2.210828 3.907158 -0.000186
H  -3.897557 -2.714726 0.000073
H  4.487065 2.140729 -0.000074
