program: Gaussian 09
title: 000090412
version: EM64L-G09RevD.01
frameworkgroup: C1[X(C21H25NO2)]
method: RPBEPBE
basis: SDD
operation: Freq
keyword: #p
keyword: freq=noraman
keyword: PBEPBE/SDD
title: #p freq=noraman PBEPBE/SDD
converged: YES YES NO NO
title: Mulliken charges:
elementType: O O N C C C C C C C C C C C C C C C C C C C C C H H H H H H H H H H H H H H H H H H H H H H H H H
charge: -0.234381 -0.258343 -0.065979 -0.216109 -0.446614 -0.455401 -0.385262 -0.362445 -0.351075 0.545588 -0.538763 -0.473216 -0.400232 0.111215 -0.222858 -0.251237 -0.247679 0.287749 -0.317772 -0.354158 -0.375243 -0.359956 0.331157 -0.536784 0.202597 0.208287 0.210425 0.211994 0.207739 0.218724 0.171105 0.172760 0.203991 0.194394 0.232271 0.234373 0.250225 0.231416 0.230673 0.222720 0.221715 0.226435 0.249523 0.276366 0.253577 0.244830 0.226192 0.226517 0.248949
chargesum: 0.00000
title: Mulliken charges with hydrogens summed into heavy atoms:
elementType: O O N C C C C C C C C C C C C C C C C C C C C C
charge: -0.234381 -0.258343 -0.065979 -0.013512 -0.027901 -0.035668 0.004568 0.014305 0.075591 0.545588 -0.054165 -0.241800 -0.169559 0.111215 -0.000139 -0.029522 -0.021244 0.287749 -0.068249 -0.077792 -0.121666 -0.115126 0.331157 0.164874
polarizability: 3.64538922e+02 -7.25297355e+00 2.22270701e+02 -4.63969243e+00 1.03301190e+01 1.53257570e+02
1716.lowfreq: -3.4806 -0.0013 -0.0010 0.0004 3.3742 4.9147 17.4638 21.9864 23.8260
frequency: 17.4286 21.0350 23.8248 35.5516 57.2361 74.3118 80.6574 90.9530 103.8287 133.7285 135.4872 146.6253 198.1714 219.1924 223.0743 238.0993 268.6467 291.7079 294.7455 295.6597 315.6739 360.1903 376.2749 404.8585 414.5300 451.1483 467.1635 468.6833 489.1072 511.9726 528.5907 536.9673 569.8086 582.3566 617.0120 627.2838 637.5216 705.4445 718.3135 731.5899 768.3123 770.0200 787.3475 802.6912 805.4842 819.5696 824.8761 844.1979 849.8271 885.5942 906.8712 936.5711 964.4370 969.4997 972.2023 982.7598 984.2068 987.4925 989.3670 991.7229 993.7730 1005.3780 1027.3635 1037.5533 1042.8670 1070.8937 1084.0979 1103.2947 1108.4889 1112.0735 1113.7333 1130.5809 1137.0534 1158.2266 1159.4771 1170.7063 1172.9372 1188.0976 1194.6424 1209.1657 1219.9138 1239.2109 1248.5324 1253.9491 1270.9716 1287.4389 1298.0983 1301.8077 1305.1536 1314.0053 1329.7020 1337.1993 1341.7846 1362.3897 1366.8929 1375.4366 1385.1201 1396.1644 1427.2036 1435.0376 1438.3406 1442.0535 1448.7997 1458.9557 1461.0330 1465.6257 1469.0153 1472.1421 1477.8502 1482.7595 1499.4449 1558.2366 1586.1843 1591.3143 1613.1460 1621.2803 2813.0467 2826.1951 2880.4386 2957.2782 2967.3674 2973.3268 2988.9809 2991.5110 3021.1705 3025.1956 3031.0529 3050.8512 3051.1464 3056.4621 3058.6104 3112.5074 3116.3162 3130.7969 3131.3956 3141.3583 3146.2493 3146.3698 3160.2929 3166.6357 3172.0858
redmass: 4.1967 4.1428 4.5018 4.3893 4.1574 3.7668 4.5629 3.6137 2.3571 4.5477 3.9392 4.8555 3.5624 2.4060 1.2428 2.2066 3.3779 3.0685 4.5105 3.4641 4.3855 2.4374 3.5337 2.7997 2.9505 3.4653 2.8394 2.8842 3.0108 3.9146 3.4408 2.9885 2.1581 5.7330 6.3990 7.0673 3.9035 1.6382 4.3390 3.0594 2.1555 3.7001 1.7236 2.5105 1.6246 3.4062 1.2506 1.6478 1.2485 3.0815 1.5471 1.7768 1.3676 2.4001 1.5254 4.6408 1.8320 1.5263 4.9770 1.3238 3.0116 2.4386 2.2036 1.9521 2.3029 1.7600 2.7623 2.1609 2.4176 1.2595 1.3453 2.1293 2.2906 1.3403 1.2729 1.0563 1.2499 1.1117 1.4544 1.9202 1.5856 3.2570 1.6379 1.6441 1.3621 1.2274 1.5140 1.3412 1.3533 1.7197 1.2921 1.3423 1.3743 1.5979 1.5057 4.6005 4.5686 1.4872 3.3409 1.1863 1.1840 2.1143 1.0911 1.0980 1.0890 1.0806 1.0500 1.0719 1.1240 2.1888 2.4708 7.6737 7.4610 5.9396 6.1604 6.6468 1.0717 1.0704 1.0709 1.0827 1.0327 1.0597 1.0595 1.0609 1.0952 1.0864 1.0869 1.1029 1.0911 1.1025 1.1043 1.0865 1.0861 1.0909 1.1000 1.0959 1.0879 1.0879 1.1014 1.0954 1.0967
irintensity: 0.0307 0.3612 0.2539 1.1699 0.5185 3.1933 0.3413 1.3417 4.2891 1.2518 3.7541 1.1679 11.3786 0.4032 0.0053 0.6221 0.4724 3.3578 3.3753 3.3453 1.5140 2.4221 1.2311 0.0075 0.0780 10.7014 2.4953 2.9110 6.3353 1.4164 13.7318 10.9125 11.2812 31.1456 0.0921 3.6583 1.5842 55.1562 7.8422 0.3378 29.6941 9.8968 27.3295 8.2408 0.1813 15.3595 0.4698 55.5490 0.0129 3.0914 2.9962 8.7629 1.8816 97.4991 19.3704 36.0811 0.1361 4.5435 0.5645 0.2423 7.9666 3.5208 3.3200 5.8619 4.5474 13.6831 0.9322 39.2023 4.0781 0.1933 11.9697 41.8143 7.6046 0.6477 2.4956 0.0304 209.1956 0.1704 2.4846 4.7308 35.3106 178.3849 94.3402 9.8343 4.3790 14.7208 58.1951 7.1505 9.3101 115.8447 6.7570 0.8155 59.5354 7.7708 26.2696 74.4364 1.0116 6.0090 1.5636 18.7788 2.0392 6.2918 6.1847 10.8652 4.6091 1.4973 15.2808 53.0131 20.9012 17.9097 22.7526 105.5016 165.1602 1.7045 15.0561 149.8280 52.9025 127.8864 95.0874 21.7044 72.2312 26.6756 25.4275 32.9744 9.2873 59.6286 35.8024 17.1084 29.2987 57.1381 43.4390 9.9969 6.3864 13.8931 22.9386 48.8279 4.3547 5.7215 28.1358 16.8845 5.0983
temp: 298.150 k
press: 1.00000 atm
elementType: 8 8 7 6 6 6 6 6 6 6 6 6 6 6 6 6 6 6 6 6 6 6 6 6 1 1 1 1 1 1 1 1 1 1 1 1 1 1 1 1 1 1 1 1 1 1 1 1 1
symmnumber: 1
zpe: 1077995.3 jmol-1
zpe.correction: 0.410587 hartree
zpe.thermalcorrener: 0.433031 hartree
zpe.thermalcorrenthalpy: 0.433975 hartree
zpe.thermalcorrgfe: 0.355813 hartree
zpe.sumelectzpe: -1018.643788 hartree
zpe.sumelectthermal: -1018.621344 hartree
zpe.sumelectthermalent: -1018.620400 hartree
zpe.sumelectthermalfe: -1018.698562 hartree
dipole: 2.6686 -1.7323 0.6997
dipole: 3.2576
quadrupole: -100.2107 -149.7196 -143.6828
quadrupole: -5.2460 -2.2738 3.6237
quadrupole: 30.9936 -18.5153 -12.4784 -5.2460 -2.2738 3.6237
hfenergy: -1019.0543751 hartree
pointgroup: C01 [X(C21H25N1O2)]
dipole: 1.0440325 -0.7048916 0.2359639 debye
polarizability: 364.4201862|-8.1567988|220.9705001|-4.8226207|14.2832508|154.6765061 unknown
InChI: InChI=1S/C21H25NO2/c1-24-20-9-7-19(8-10-20)21(23)13-16-22-14-11-18(12-15-22)17-5-3-2-4-6-17/h2-10,18H,11-16H2,1H3
charge 0 multiplicity 1
49 atoms
O  2.868805 2.580296 -0.047816
O  7.439654 -1.99073 -0.053116
N  -1.098414 1.025969 -0.09917
C  -3.983129 0.500475 0.388433
C  -3.469617 1.311288 -0.83334
C  -2.861341 -0.473076 0.846569
C  -2.134133 2.008392 -0.512576
C  -1.540134 0.277352 1.104453
C  0.226516 1.672857 0.077479
C  -5.300623 -0.21834 0.110601
C  1.37773 0.652342 0.055769
C  -6.456617 0.063093 0.882685
C  -5.404284 -1.190079 -0.921016
C  2.757195 1.315874 -0.002892
C  -7.68001 -0.602235 0.637409
C  -6.622996 -1.85781 -1.17038
C  -7.767992 -1.567069 -0.39138
C  3.972513 0.441777 -0.012858
C  3.905056 -0.981726 -0.00384
C  5.252984 1.055597 -0.037347
C  5.072648 -1.759294 -0.018327
C  6.433936 0.291922 -0.050594
C  6.343144 -1.125816 -0.041058
C  8.782787 -1.399509 -0.079517
H  -4.154922 1.222129 1.215977
H  -4.222118 2.06663 -1.130321
H  -3.320241 0.63234 -1.694501
H  -2.693229 -1.236706 0.063218
H  -3.173403 -1.003475 1.766665
H  -1.765671 2.54418 -1.407139
H  -2.304965 2.777846 0.288043
H  -1.673544 0.971641 1.978375
H  -0.755872 -0.449313 1.384928
H  0.278623 2.278918 1.015772
H  0.378445 2.383148 -0.754683
H  1.343771 -0.014086 0.940645
H  1.247522 -0.006347 -0.82695
H  -6.395924 0.810654 1.683941
H  -4.526515 -1.426255 -1.535007
H  -8.560695 -0.368274 1.246748
H  -6.682136 -2.603957 -1.971346
H  -8.714197 -2.084944 -0.584855
H  2.935128 -1.489261 0.01007
H  5.293648 2.150193 -0.046558
H  5.034522 -2.852604 -0.013878
H  7.404711 0.79582 -0.068661
H  8.964709 -0.778872 0.818595
H  8.934583 -0.791405 -0.99168
H  9.47099 -2.25685 -0.08507
