program: Gaussian 09
title: 000090353
version: EM64L-G09RevD.01
frameworkgroup: C1[X(C9H10O5)]
method: RPBEPBE
basis: SDD
operation: Freq
keyword: #pfreq=noraman
keyword: PBEPBE/SDD
title: #p freq=noraman PBEPBE/SDD
converged: YES YES NO NO
title: Mulliken charges:
elementType: O O O O O C C C C C C C C C H H H H H H H H H H
charge: -0.209948 -0.248074 -0.418441 -0.291936 -0.230410 0.252913 0.150655 0.050655 -0.345291 0.150797 -0.768627 0.193229 -0.225444 -0.668084 0.296397 0.249390 0.249388 0.272993 0.235912 0.235931 0.215287 0.233692 0.233693 0.385323
chargesum: 0.00000
title: Mulliken charges with hydrogens summed into heavy atoms:
elementType: O O O O O C C C C C C C C C
charge: -0.209948 -0.248074 -0.033118 -0.291936 -0.230410 0.252913 0.150655 0.050655 -0.048895 0.150797 0.003144 0.193229 0.246399 0.014588
polarizability: 1.75587687e+02 -6.85022894e+00 1.35480511e+02 2.07070354e-02 -6.18529648e-03 6.09493776e+01
1716.lowfreq: -0.0006 -0.0003 0.0004 0.9261 5.9911 10.1294 34.1263 66.8825 81.9979
frequency: 33.8692 66.7420 81.9806 82.9025 88.2743 126.1855 162.9441 205.8821 208.8792 245.9735 258.1245 286.3292 304.3665 351.6437 352.1094 409.7715 505.1013 509.8350 518.0926 537.4488 602.4697 676.7950 693.9094 727.6017 734.2077 775.5060 799.3793 811.0961 885.6829 896.5975 953.4141 1017.4549 1042.7312 1046.0608 1067.5424 1114.0844 1134.6679 1177.9845 1216.2686 1219.3785 1251.5136 1293.0920 1314.9724 1361.9941 1383.3790 1405.1813 1409.4543 1458.8668 1459.0290 1463.1099 1471.5821 1484.8928 1517.5026 1601.4424 1606.1208 1665.1398 2991.5225 2999.9501 3014.5381 3069.7049 3074.9045 3096.2736 3112.8339 3124.1999 3195.6409 3266.7548
redmass: 4.3787 2.6113 3.7512 4.1153 1.1219 4.1008 3.1901 4.7207 4.5962 1.3379 3.5436 6.2589 5.1539 5.4679 7.9473 5.3089 4.2246 7.9200 6.9798 9.9123 5.0624 1.0824 7.6028 5.1917 9.1571 8.3603 1.1065 3.9979 3.1452 1.4219 4.0123 2.2458 1.4575 3.3027 2.4975 2.2575 1.4649 5.3920 2.5675 3.6964 1.1317 1.8711 2.4058 1.5038 4.2959 1.2767 1.4530 1.0685 1.0437 1.0395 1.0691 1.0668 10.2924 7.5241 11.6919 6.8265 1.0380 1.0361 1.0582 1.0978 1.1069 1.0985 1.1027 1.0981 1.0931 1.0627
irintensity: 0.0066 0.7494 0.0246 0.3359 0.1837 1.5718 0.5992 8.5500 2.2088 1.4183 8.1553 19.3043 7.7831 14.4365 0.6046 0.6654 0.3460 0.3291 6.7838 5.5630 0.1318 125.3593 9.5285 12.6720 6.9364 4.3037 3.5436 9.3925 49.7231 32.6303 13.8347 23.0699 2.8061 253.1347 33.2150 4.9275 6.4711 175.2312 49.9512 409.4012 0.0518 108.9785 57.8899 0.7617 85.0332 14.4548 53.0362 34.7432 18.0038 13.9962 4.7352 14.1809 171.3440 93.0725 210.9889 78.9193 9.0325 18.2470 15.3727 9.7392 6.6381 26.3202 39.4734 1.7229 2.9488 72.4099
temp: 298.150 k
press: 1.00000 atm
elementType: 8 8 8 8 8 6 6 6 6 6 6 6 6 6 1 1 1 1 1 1 1 1 1 1
symmnumber: 1
zpe: 466680.5 jmol-1
zpe.correction: 0.177749 hartree
zpe.thermalcorrener: 0.191957 hartree
zpe.thermalcorrenthalpy: 0.192901 hartree
zpe.thermalcorrgfe: 0.135782 hartree
zpe.sumelectzpe: -724.012346 hartree
zpe.sumelectthermal: -723.998139 hartree
zpe.sumelectthermalent: -723.997194 hartree
zpe.sumelectthermalfe: -724.054313 hartree
dipole: -3.6441 3.7200 0.0006
dipole: 5.2075
quadrupole: -76.9673 -87.1010 -80.1194
quadrupole: 2.6269 0.0002 0.0008
quadrupole: 4.4286 -5.7051 1.2765 2.6269 0.0002 0.0008
hfenergy: -724.1900953 hartree
pointgroup: C01 [X(C9H10O5)]
dipole: -1.4078439 1.4884628 0.0002209 debye
dipolederiv: -0.5638251 0.0986308 -0.0002266 -0.0463695 -0.7120672 0.0000598 -0.0003472 0.0000213 -0.0963273 -1.5553479 0.4227566 0.0002743 0.7190411 -0.7335237 -0.0000009 0.0009887 -0.0004613 -0.2595022 -1.2902846 -0.1813689 -0.0003472 -0.3181454 -0.1995363 -0.0002767 -0.0004656 -0.0002094 -0.3947352 -0.9487315 0.4712288 -0.0003088 0.3319785 -0.7588386 0.0002331 -0.0001096 0.0000412 -0.376866 -0.8007892 -0.2162439 -0.0002054 -0.0237258 -0.8910205 -0.0005272 0.0000177 0.0005605 -0.3076558 0.2143297 -0.3625258 0.0001857 0.3539983 0.9053642 -0.00004 -0.0001248 -0.0002161 -0.0096154 -0.3444102 -0.2500414 0.0000399 -0.0010081 0.539477 -0.0000563 -0.000343 -0.0000662 0.0735508 1.1107666 0.2903318 0.0004783 0.2592476 -0.7540989 0.0002782 0.0006524 0.0003163 0.0740624 -0.4030806 0.3617044 -0.0000318 -0.1403897 -0.0331291 -0.000031 -0.0003446 0.0001057 -0.1259726 0.9342047 -0.4935268 0.0002491 -0.5667985 0.818477 -0.0003575 0.000356 -0.0001362 0.185113 -0.0269969 0.0516917 -0.0000349 -0.1001781 -0.2580814 -0.0000022 0.0000062 0.0000183 0.0654485 2.0200605 -0.0114132 0.0002041 -0.4951477 1.3093361 0.0005002 0.0000844 -0.0001623 0.2395188 1.044438 -0.2153556 -0.0002595 -0.129227 0.2765866 0.000031 -0.0003892 0.0001604 0.3489057 -0.0747045 0.0945745 0.0000414 0.0759531 -0.0565503 -0.0000873 0.0000843 -0.0000936 0.0552277 0.1224471 -0.0274043 -0.0000332 -0.0467355 0.0725054 -0.000007 -0.0000434 -0.000019 0.1620943 0.0842056 0.0336418 0.0881264 0.0208045 0.0268003 -0.0385577 0.073621 -0.0807307 -0.0155627 0.0843418 0.0335418 -0.0880527 0.0207316 0.0268162 0.0385735 -0.0735356 0.0807745 -0.0157568 -0.029528 -0.0610584 -0.0000618 0.0072863 0.0988115 0.0000072 -0.0000677 -0.0000112 0.132447 -0.0685057 0.0438381 0.0014248 -0.0317473 0.0046263 -0.0914915 -0.0356587 -0.0895739 -0.0507255 -0.0684461 0.0439781 -0.0014698 -0.0316122 0.0045513 0.0915235 0.0356159 0.0895232 -0.0506687 -0.1727649 -0.007749 0.0001584 -0.022779 0.072665 0.0000183 0.00019 -0.000004 0.1192457 0.1191774 -0.0486496 -0.0634533 0.0086719 0.0157799 -0.084615 -0.0413541 -0.1000863 -0.0575589 0.1193082 -0.0485457 0.0632421 0.0087753 0.015693 0.0846427 0.0411121 0.1001862 -0.0576072 0.4941353 -0.0220358 0.0000604 0.1473755 0.2093562 0.0001828 0.0000546 0.0000628 0.3629402 unknown
polarizability: 175.3353004|-7.5488048|135.7328978|0.0205955|-0.0065472|60.9493776 unknown
InChI: InChI=1S/C9H10O5/c1-3-13-9(12)7-4-6(10)8(11)5(2)14-7/h4,11H,3H2,1-2H3
charge 0 multiplicity 1
24 atoms
O  0.077019 0.8824 -0.000739
O  -2.48189 0.291865 -0.000651
O  3.764341 0.746939 0.001121
O  3.185028 -1.864846 0.000561
O  -2.079627 -2.009244 -0.000318
C  1.414832 1.319734 -0.000208
C  -0.211838 -0.476145 -0.000717
C  2.429998 0.384938 0.000441
C  0.771095 -1.445734 -0.000088
C  2.172209 -1.068708 0.000653
C  1.555975 2.80641 -0.000358
C  -1.665822 -0.823712 -0.001483
C  -3.957133 0.012203 0.000249
C  -4.657019 1.36514 0.001006
H  0.477412 -2.497586 -0.000211
H  1.075665 3.250351 0.890629
H  1.076479 3.25008 -0.891918
H  2.623769 3.073447 0.000091
H  -4.189984 -0.59152 -0.895234
H  -4.188832 -0.591914 0.895767
H  -5.75194 1.21567 0.001683
H  -4.385797 1.950284 0.895858
H  -4.386956 1.950683 -0.893935
H  4.270317 -0.127134 0.001801
