program: Gaussian 09
title: 000090363
version: EM64L-G09RevD.01
frameworkgroup: C1[X(C10H7Cl2NO2)]
method: RPBEPBE
basis: SDD
operation: Freq
keyword: #p
keyword: freq=noraman
keyword: PBEPBE/SDD
title: #p freq=noraman PBEPBE/SDD
converged: YES YES NO NO
title: Mulliken charges:
elementType: Cl Cl O O N C C C C C C C C C C H H H H H H H
charge: -0.040933 -0.040934 -0.190585 -0.190579 -0.325432 -0.514172 -0.514170 0.168111 0.168094 0.534361 -0.313648 -0.313689 -0.076125 -0.076158 -0.252515 0.270784 0.271689 0.270787 0.271687 0.303696 0.303693 0.286037
chargesum: 0.00000
title: Mulliken charges with hydrogens summed into heavy atoms:
elementType: Cl Cl O O N C C C C C C C C C C
charge: -0.040933 -0.040934 -0.190585 -0.190579 -0.325432 0.028301 0.028304 0.168111 0.168094 0.534361 -0.009952 -0.009996 -0.076125 -0.076158 0.033523
polarizability: 1.83183622e+02 -2.61842048e-04 1.65185263e+02 -5.13167901e-04 1.80094801e+00 6.84096778e+01
1716.lowfreq: -8.7163 -5.2932 -3.8629 -0.0023 -0.0021 -0.0017 26.7170 66.6841 67.0732
frequency: 26.7169 66.6824 67.0696 89.1080 123.7692 160.6953 161.5045 197.5176 245.6824 278.0400 296.7322 381.9366 411.6034 437.6580 442.6091 509.4405 527.1242 538.5965 570.9351 597.6212 610.7243 648.0588 671.3232 740.5349 757.2427 824.4807 860.8529 870.6653 873.4302 953.1612 982.0742 1006.0641 1011.0064 1035.4689 1100.0644 1114.3679 1135.8691 1149.2341 1172.9466 1213.4743 1266.7725 1269.4091 1300.1665 1326.0795 1374.7289 1419.6206 1438.3345 1442.3746 1455.0912 1566.7865 1597.2851 1637.2884 1698.0078 3027.5042 3036.3941 3079.0611 3096.1699 3188.7538 3208.9857 3210.5446
redmass: 10.6410 4.6781 1.8370 9.1194 13.2532 20.6099 7.0062 4.6662 9.9731 12.6531 5.5460 13.4420 8.3638 8.4892 5.1478 5.0856 3.5156 3.5026 4.1235 11.6336 3.4384 4.6578 2.5742 8.2361 10.7783 1.5211 1.5664 1.3850 1.4887 7.6766 5.8689 5.7819 2.1852 2.3288 1.5487 1.8356 5.7285 1.2291 6.3022 1.1138 1.2141 1.7452 1.5019 4.4254 10.4876 2.9196 1.0783 3.1183 1.1191 7.4688 7.2155 12.0412 12.5922 1.0595 1.0638 1.1030 1.1013 1.0941 1.0929 1.0939
irintensity: 0.0870 6.8998 0.0422 2.9400 4.4240 0.1022 0.4496 0.0381 0.3776 4.1662 0.3678 16.0133 8.2534 7.9162 0.8200 0.0108 0.9129 0.2022 1.6809 24.6626 6.4455 26.1960 41.8226 15.1712 74.1343 10.1019 52.5147 0.0006 11.6849 1.2430 5.4194 8.0131 0.6693 32.5686 30.4538 3.5917 259.4054 5.1041 173.9848 1.0041 1.1326 10.2816 0.0258 214.9887 0.2777 66.5500 4.8077 142.8196 10.4379 91.0805 124.6894 508.9672 3.2014 10.4686 1.4007 0.0165 5.2625 1.7430 6.8661 2.7309
temp: 298.150 k
press: 1.00000 atm
elementType: 17 17 8 8 7 6 6 6 6 6 6 6 6 6 6 1 1 1 1 1 1 1
symmnumber: 1
zpe: 391785.6 jmol-1
zpe.correction: 0.149223 hartree
zpe.thermalcorrener: 0.162554 hartree
zpe.thermalcorrenthalpy: 0.163498 hartree
zpe.thermalcorrgfe: 0.107155 hartree
zpe.sumelectzpe: -1509.545545 hartree
zpe.sumelectthermal: -1509.532214 hartree
zpe.sumelectthermalent: -1509.531270 hartree
zpe.sumelectthermalfe: -1509.587613 hartree
dipole: 4.1653 0.0002 0.0001
dipole: 4.1653
quadrupole: -79.3702 -114.3417 -102.6824
quadrupole: 0.0012 0.0007 -7.3140
quadrupole: 19.4279 -15.5436 -3.8843 0.0012 0.0007 -7.3140
hfenergy: -1509.6947681 hartree
pointgroup: C01 [X(C10H7Cl2N1O2)]
dipole: -1.638765 0.0000883 -0.0000663 debye
dipolederiv: -0.3291751 -0.2811455 -0.0842014 -0.3202796 -0.5808447 -0.1622199 -0.098664 -0.1567838 -0.1067342 -0.3290465 0.2811012 0.0841304 0.3202362 -0.5810022 -0.1621975 0.0985936 -0.1567649 -0.1067076 -0.5562914 0.1753283 -0.0722286 -0.1319231 -1.0198065 0.2461881 0.0725522 0.2222777 -0.3854401 -0.556244 -0.175398 0.0722447 0.1318938 -1.0198317 0.2462125 -0.072524 0.2222675 -0.385448 -1.4255797 0.0000225 -0.0000509 0.0000165 -1.3960291 0.366564 -0.0000417 0.3481766 -0.2389498 -0.4158458 0.0735172 -0.02454 -0.0161282 0.0009924 0.0342168 -0.0231351 0.0257322 0.0935973 -0.4158557 -0.0734701 0.024498 0.0161811 0.000995 0.0342157 0.0231057 0.0257208 0.0936038 1.1279769 0.2718876 -0.0945333 0.5854618 1.5658794 -0.478404 -0.1219982 -0.4136213 0.3322836 1.1278644 -0.2718282 0.0945619 -0.5854505 1.5660577 -0.4785148 0.122033 -0.413687 0.3323232 1.063827 -0.0000756 0.0000678 -0.0001089 0.2022165 0.1536153 0.0000564 0.124274 0.1166459 -0.3895162 0.1930078 0.0331375 0.2027752 -0.2655027 -0.0635822 0.0078852 -0.0893845 -0.1193908 -0.3895836 -0.1929611 -0.0331864 -0.2027104 -0.2654053 -0.0635915 -0.0079449 -0.089393 -0.1194024 0.5709248 0.4343736 0.1144878 0.4963813 0.9099404 0.3008816 0.1745846 0.26786 0.0342214 0.5707479 -0.4343335 -0.1143362 -0.4963353 0.9101916 0.3008394 -0.1744425 0.2678324 0.0341771 -0.2381604 -0.0000257 -0.000026 -0.0000317 -0.4910331 -0.1429762 -0.0000294 -0.1214771 -0.1191731 0.0590156 -0.0349547 -0.0349406 -0.0174333 0.0129183 -0.0493356 -0.0807176 -0.0704015 0.0495731 0.0791793 -0.0076738 0.0472564 0.0265712 0.0770397 0.0259612 0.0744156 0.0475382 -0.0230182 0.0590108 0.0349569 0.0349356 0.0174312 0.0129152 -0.0493368 0.0807084 -0.0704061 0.049585 0.0791873 0.0076702 -0.0472454 -0.0265694 0.0770416 0.0259636 -0.0744039 0.0475477 -0.0230326 0.141469 -0.0413963 -0.0131677 -0.0317601 0.0835113 -0.0329939 -0.0188263 -0.0035618 0.1597813 0.1414384 0.041385 0.0131479 0.0317696 0.0834873 -0.0329953 0.0188052 -0.0035762 0.1597852 0.0246571 0.0000123 -0.0000116 0.0000124 0.1162687 -0.0185105 -0.0000124 -0.01017 0.1717199 unknown
polarizability: 183.1836211|-0.0030617|163.686271|0.0092392|12.0856236|69.908671 unknown
InChI: InChI=1S/C10H7Cl2NO2/c11-6-3-7(12)5-8(4-6)13-9(14)1-2-10(13)15/h3-5H,1-2H2
charge 0 multiplicity 1
22 atoms
Cl 3.197891 2.657923 0.795573
Cl 3.197306 -2.658589 -0.795287
O  -1.624388 -2.262533 0.665903
O  -1.624092 2.262972 -0.666262
N  -1.257728 0.000196 -0.000146
C  -3.533942 -0.734955 0.229448
C  -3.533836 0.735602 -0.229966
C  -2.064141 -1.139669 0.337035
C  -2.063978 1.140145 -0.337439
C  0.182966 0.000063 -0.000073
C  0.884096 -1.180745 -0.3545
C  0.884354 1.180686 0.354472
C  2.28882 1.148835 0.342586
C  2.288568 -1.149256 -0.342443
C  3.026713 -0.000303 0.000109
H  -4.037493 -1.415343 -0.478193
H  -4.011311 -0.885749 1.212851
H  -4.037371 1.416051 0.477628
H  -4.0111 0.886447 -1.213412
H  0.350779 -2.096335 -0.6105
H  0.351249 2.096404 0.610438
H  4.118738 -0.000444 0.000178
