program: Gaussian 09
title: 000090373
version: EM64L-G09RevD.01
frameworkgroup: C1[X(C15H12N2OS)]
method: RPBEPBE
basis: SDD
operation: Freq
keyword: #p
keyword: freq=noraman
keyword: PBEPBE/SDD
title: #p freq=noraman PBEPBE/SDD
converged: YES YES NO NO
title: Mulliken charges:
elementType: S O N N C C C C C C C C C C C C C C C H H H H H H H H H H H H
charge: 0.232762 -0.185959 -0.191654 -0.077861 0.333801 0.248779 -0.174690 -0.345547 -0.303853 -0.314939 -0.303652 -0.765277 0.092331 -0.237602 -0.208375 -0.238885 -0.208295 -0.243081 -0.229585 0.260036 0.264260 0.338810 0.264289 0.297369 0.297291 0.228053 0.236133 0.232182 0.236185 0.231380 0.235596
chargesum: 0.00000
title: Mulliken charges with hydrogens summed into heavy atoms:
elementType: S O N N C C C C C C C C C C C C C C C
charge: 0.232762 -0.185959 -0.191654 -0.077861 0.333801 0.248779 -0.174690 -0.085512 -0.039593 0.023871 -0.039363 -0.170616 0.092331 -0.009550 0.027757 -0.006703 0.027890 -0.011701 0.006012
polarizability: 2.53087912e+02 -5.58564038e+00 2.39337084e+02 3.57698111e-02 3.43224217e-01 1.16171863e+02
1716.lowfreq: -6.6241 -2.8946 0.0007 0.0017 0.0021 7.1570 17.6134 41.1710 54.3115
frequency: 16.7640 41.1032 54.2823 67.6615 71.6969 114.2514 121.8053 172.3539 216.1526 239.0468 267.5613 278.4297 310.8868 407.2519 409.8635 431.1710 442.0242 497.0848 511.4209 515.7883 554.4842 577.1944 603.9987 615.2213 626.0960 644.3126 669.6086 696.1706 699.3776 731.3883 753.5367 766.5922 807.2642 824.7639 847.4858 852.4855 888.1429 923.3707 931.6820 937.1033 980.0109 983.3676 985.4157 990.2277 1000.7038 1015.5884 1023.3395 1031.9193 1076.5706 1092.4296 1102.7223 1116.0494 1133.2642 1174.5466 1174.8395 1179.0449 1199.0624 1209.3222 1250.5631 1286.9260 1309.2186 1332.3868 1379.3429 1381.8306 1414.9619 1437.8188 1444.6421 1476.6500 1479.8870 1536.4429 1588.2852 1595.7293 1603.7277 1611.6722 1648.8913 3052.9264 3131.1109 3131.3975 3135.0915 3142.2265 3144.3550 3154.6657 3161.5975 3163.5001 3174.2472 3175.6206 3181.1258
redmass: 3.8604 9.1211 4.1017 5.5997 5.1433 6.7364 3.2830 7.6943 4.4848 6.5871 8.2559 5.8077 4.9755 2.8610 2.9153 5.2160 9.7875 7.4093 5.3454 3.8003 2.8282 8.1995 7.5656 6.1825 7.6515 6.2957 7.4658 2.1266 1.8876 6.0504 2.3103 1.6213 3.7275 6.7647 1.2540 1.2488 1.7723 2.7266 1.3933 2.1010 1.3843 1.3438 6.0577 6.2832 1.3243 1.2977 2.1604 2.2508 1.5302 1.6118 1.1379 6.6315 3.5923 1.0555 1.0502 1.1215 1.1525 1.3067 4.0543 5.5249 1.3296 1.4071 9.5927 9.3105 1.0818 2.1944 2.4139 2.1523 2.3782 10.1237 6.5783 6.5319 6.0862 6.2057 12.1326 1.0563 1.1078 1.0853 1.0854 1.0905 1.0887 1.0931 1.0955 1.0974 1.1018 1.0958 1.0966
irintensity: 0.2073 2.1646 0.3617 0.1834 0.8414 2.3888 7.4240 0.0645 0.4004 2.1302 1.1201 4.9802 3.1499 0.0186 0.0013 3.3845 5.4032 28.8292 0.7928 5.0074 2.4165 20.5180 0.1840 0.8416 0.1141 14.7136 0.3610 30.5684 53.2566 8.7455 21.9226 74.2786 8.5674 6.0930 1.2739 0.0601 5.5004 0.3388 5.1398 0.1732 0.0689 0.5526 0.0214 4.1812 0.0665 3.4044 13.6460 10.1809 10.2769 11.0645 0.3657 341.9497 47.3939 0.0057 0.0378 3.3307 0.5302 13.0570 85.3026 120.9585 0.0294 6.7180 2.5060 5.4263 20.3209 8.4274 58.6233 120.7178 23.3058 1173.7429 22.2676 2.4120 22.2563 30.0560 86.3112 5.6866 0.7860 0.1856 0.0336 17.9029 4.6582 20.5711 24.6882 12.5464 10.8565 4.8050 34.5739
temp: 298.150 k
press: 1.00000 atm
elementType: 16 8 7 7 6 6 6 6 6 6 6 6 6 6 6 6 6 6 6 1 1 1 1 1 1 1 1 1 1 1 1
symmnumber: 1
zpe: 610885.9 jmol-1
zpe.correction: 0.232674 hartree
zpe.thermalcorrener: 0.248535 hartree
zpe.thermalcorrenthalpy: 0.249479 hartree
zpe.thermalcorrgfe: 0.187093 hartree
zpe.sumelectzpe: -1160.265031 hartree
zpe.sumelectthermal: -1160.249170 hartree
zpe.sumelectthermalent: -1160.248226 hartree
zpe.sumelectthermalfe: -1160.310612 hartree
dipole: 4.8405 -4.3186 0.0180
dipole: 6.4870
quadrupole: -122.4025 -110.3508 -113.1901
quadrupole: 9.3513 -0.0175 0.1471
quadrupole: -7.0880 4.9637 2.1244 9.3513 -0.0175 0.1471
hfenergy: -1160.4977048 hartree
pointgroup: C01 [X(C15H12N2O1S1)]
dipole: -2.4417764 0.7186357 -0.186731 debye
polarizability: 247.6692451|-8.304831|244.0345581|8.2298147|-5.6552031|116.893056 unknown
InChI: InChI=1S/C15H12N2OS/c18-14-11-19-15(16-14)17(12-7-3-1-4-8-12)13-9-5-2-6-10-13/h1-10H,11H2
charge 0 multiplicity 1
31 atoms
S  -0.258233 -2.798452 0.150313
O  3.719814 -3.018796 0.412499
N  0.055116 -0.021453 0.069594
N  2.068098 -1.33269 0.246531
C  0.642511 1.310352 0.054854
C  -1.403001 -0.122518 -0.01979
C  0.754173 -1.201899 0.157919
C  -0.230367 2.430497 -0.029322
C  -2.01777 -0.198747 -1.28913
C  2.045839 1.524813 0.120606
C  -2.173742 -0.135646 1.163712
C  1.37278 -3.719921 0.285274
C  2.520114 -2.665973 0.322826
C  0.295128 3.738825 -0.048117
C  -3.424475 -0.296754 -1.372511
C  2.551957 2.841692 0.100307
C  -3.580213 -0.234159 1.073453
C  1.68928 3.957153 0.016082
C  -4.205658 -0.314269 -0.192996
H  -1.312807 2.290396 -0.080135
H  -1.397781 -0.184419 -2.191342
H  2.714998 0.665841 0.18768
H  -1.672758 -0.072768 2.135075
H  1.503917 -4.377688 -0.587541
H  1.389395 -4.317573 1.209518
H  -0.394173 4.58787 -0.113308
H  -3.907335 -0.361721 -2.353189
H  3.636455 2.988548 0.151456
H  -4.183357 -0.250043 1.98727
H  2.093301 4.974869 0.000781
H  -5.296206 -0.391867 -0.260471
