program: Gaussian 09
title: 000090347
version: EM64L-G09RevD.01
frameworkgroup: C1[X(C8H20N4)]
method: RPBEPBE
basis: SDD
operation: Freq
keyword: #pfreq=noraman
keyword: PBEPBE/SDD
title: #p freq=noraman PBEPBE/SDD
converged: YES YES NO NO
title: Mulliken charges:
elementType: N N N N C C C C C C C C H H H H H H H H H H H H H H H H H H H H
charge: -0.089944 -0.295433 -0.291057 -0.579943 -0.321811 -0.331800 -0.353240 -0.422419 -0.416996 -0.373275 -0.331344 -0.391547 0.187733 0.197913 0.204258 0.186581 0.223943 0.163468 0.189900 0.205196 0.204781 0.189508 0.265898 0.184742 0.223622 0.235619 0.195142 0.205289 0.192398 0.206252 0.275343 0.261221
chargesum: 0.00000
title: Mulliken charges with hydrogens summed into heavy atoms:
elementType: N N N N C C C C C C C C
charge: -0.089944 -0.029534 -0.055437 -0.043379 0.063835 0.059039 0.034172 -0.027324 -0.022707 0.035089 0.069088 0.007104
polarizability: 1.48316919e+02 -1.37286096e+00 1.03158839e+02 -2.15847784e+00 -5.02778989e-01 9.55193872e+01
1716.lowfreq: -20.4601 -0.0014 -0.0012 -0.0011 3.6303 12.4219 33.1915 38.8610 47.4907
frequency: 30.3639 37.8014 47.3330 88.0594 107.3295 131.0750 151.5881 202.5589 210.9290 240.1174 255.6950 304.6140 331.2323 385.9925 426.3856 452.1873 464.2569 494.9966 572.1136 602.1878 688.2820 689.8991 767.5601 798.9781 810.9930 846.2300 885.4744 915.3118 954.3065 1005.3557 1022.3919 1050.4970 1055.6337 1064.1771 1065.0090 1072.6035 1098.8836 1111.2048 1127.0400 1144.8565 1147.5009 1162.6590 1175.9141 1194.8988 1217.8638 1243.1454 1253.0524 1267.6007 1281.4462 1288.5903 1299.9423 1303.5484 1318.2847 1331.9028 1344.9205 1367.4483 1381.8708 1387.5188 1401.9526 1443.4599 1449.7630 1451.5040 1455.3801 1458.9134 1466.4115 1472.0948 1481.1539 1490.1610 1495.4825 1641.8364 2823.9712 2853.4503 2863.7736 2865.7478 2878.1933 2884.6215 2893.2445 2913.3732 2984.1556 3013.9079 3024.4548 3029.9494 3033.5830 3037.8138 3044.0932 3045.8955 3414.5309 3455.6712 3463.6114 3590.8903
redmass: 2.9044 2.5021 3.0641 3.0108 2.5400 2.3764 2.5923 1.3815 2.9347 2.3439 1.8478 2.2642 2.7676 2.1341 3.4747 2.9228 2.8906 2.3682 1.9766 1.3268 1.2817 1.6687 3.2560 1.1503 1.1695 1.4768 2.7018 2.1906 1.7631 2.8302 2.4473 1.8461 2.0010 1.8221 1.7389 2.5955 2.0010 2.5472 2.0214 2.7369 3.6565 2.6471 1.4478 1.1316 1.4283 1.2813 1.4123 1.2851 1.1032 1.2117 1.3115 1.2839 1.2646 1.3030 1.3344 1.4251 1.4102 1.4979 1.4926 1.3532 1.1051 1.1789 1.0765 1.0988 1.1052 1.0932 1.0819 1.0885 1.0835 1.0934 1.0709 1.0706 1.0709 1.0696 1.0701 1.0679 1.0684 1.0670 1.0887 1.0964 1.0851 1.0909 1.0902 1.0903 1.0881 1.0903 1.0736 1.0752 1.0450 1.0976
irintensity: 0.0881 0.6450 0.6762 0.9533 5.4621 6.3775 4.6856 33.9553 2.8282 25.6315 1.3701 6.7615 4.1478 2.4175 15.6869 6.6691 0.6502 36.9941 62.2742 227.9404 98.5180 72.2880 7.2775 0.4068 2.4322 0.1449 2.7128 1.7180 0.2334 11.9800 20.6415 1.5946 4.2418 8.7732 29.4982 3.1873 1.9337 21.1615 11.7563 10.4977 112.7965 20.1583 7.0915 1.8555 1.7867 7.7321 7.1287 4.0922 3.2062 9.1640 5.5017 9.7763 34.7022 3.9363 1.7384 3.3359 0.3320 2.2270 0.1214 2.0075 10.7114 30.3560 1.0288 6.6303 9.9501 7.2900 2.9906 5.9224 4.7899 40.9556 87.2151 72.2338 107.1808 49.2342 22.5385 276.4231 32.5580 162.3953 4.0142 86.5168 24.7727 17.1766 61.1253 69.6676 16.3365 71.5324 2.8805 2.2740 0.9060 0.3327
temp: 298.150 k
press: 1.00000 atm
elementType: 7 7 7 7 6 6 6 6 6 6 6 6 1 1 1 1 1 1 1 1 1 1 1 1 1 1 1 1 1 1 1 1
symmnumber: 1
zpe: 756653.9 jmol-1
zpe.correction: 0.288194 hartree
zpe.thermalcorrener: 0.302261 hartree
zpe.thermalcorrenthalpy: 0.303205 hartree
zpe.thermalcorrgfe: 0.245968 hartree
zpe.sumelectzpe: -534.787804 hartree
zpe.sumelectthermal: -534.773737 hartree
zpe.sumelectthermalent: -534.772793 hartree
zpe.sumelectthermalfe: -534.830030 hartree
dipole: -0.1354 -0.1913 -0.1570
dipole: 0.2821
quadrupole: -64.0912 -76.8550 -74.3648
quadrupole: 5.6709 -3.8798 1.0125
quadrupole: 7.6792 -5.0847 -2.5945 5.6709 -3.8798 1.0125
hfenergy: -535.0759981 hartree
pointgroup: C01 [X(C8H20N4)]
dipole: 0.0514733 -0.0713575 0.0676747 debye
polarizability: 148.381163|0.443818|103.1631699|-1.7802621|-0.028302|95.4508118 unknown
InChI: InChI=1S/C8H20N4/c9-1-2-10-3-6-12-7-4-11-5-8-12/h10-11H,1-9H2
charge 0 multiplicity 1
32 atoms
N  -1.493505 -0.199327 0.067828
N  -4.289122 0.452307 -0.084045
N  2.287869 -0.338818 -0.296054
N  5.95603 0.279277 0.401618
C  -1.961857 1.025424 -0.633317
C  -2.528946 -1.263422 -0.005472
C  -0.163589 -0.66216 -0.391866
C  -3.276746 1.528913 -0.011388
C  -3.843913 -0.768985 0.623485
C  0.992033 0.159142 0.214634
C  3.480004 0.313451 0.287531
C  4.773522 -0.374112 -0.194919
H  -2.135186 0.824533 -1.721722
H  -1.190866 1.812008 -0.546363
H  -2.164901 -2.14871 0.54827
H  -2.733742 -1.569306 -1.062783
H  -0.026919 -1.713352 -0.079171
H  -0.084185 -0.647612 -1.512129
H  -3.061956 1.851572 1.037228
H  -3.639762 2.405707 -0.579082
H  -4.618976 -1.550802 0.519515
H  -3.661514 -0.595287 1.712758
H  -5.223087 0.764482 0.210193
H  0.836351 1.24928 0.016971
H  0.972856 0.030632 1.312782
H  2.315618 -0.31106 -1.32626
H  3.40873 0.219523 1.390851
H  3.556927 1.404265 0.062523
H  4.84843 -0.268325 -1.295923
H  4.683517 -1.464334 0.020162
H  6.843725 0.059184 -0.057769
H  6.01706 0.179913 1.419711
