program: Gaussian 09
title: 000090358
version: EM64L-G09RevD.01
frameworkgroup: C1[X(C15H22O2)]
method: RPBEPBE
basis: SDD
operation: Freq
keyword: #pfreq=noraman
keyword: PBEPBE/SDD
title: #p freq=noraman PBEPBE/SDD
converged: YES YES NO NO
title: Mulliken charges:
elementType: O O C C C C C C C C C C C C C C C H H H H H H H H H H H H H H H H H H H H H H
charge: -0.254178 -0.220972 -0.375937 -0.372235 -0.374983 -0.352287 -0.405448 -0.356685 -0.324271 -0.695164 0.365722 -0.367744 -0.330908 -0.346964 -0.362838 0.381113 -0.209685 0.194597 0.196326 0.191079 0.189436 0.191746 0.194485 0.189313 0.188312 0.218535 0.217065 0.195461 0.195039 0.213471 0.214587 0.210001 0.210100 0.216407 0.256477 0.255129 0.235518 0.269699 0.160681
chargesum: 0.00000
title: Mulliken charges with hydrogens summed into heavy atoms:
elementType: O O C C C C C C C C C C C C C C C
charge: -0.254178 -0.220972 0.014986 0.008280 0.011248 0.025338 0.030152 0.033815 0.103787 -0.058656 0.365722 -0.111267 -0.075779 -0.111446 -0.093139 0.381113 -0.049005
polarizability: 2.79424505e+02 -1.16219125e+01 1.57828314e+02 -2.40228015e+00 -1.02547311e+00 1.02635987e+02
1716.lowfreq: -0.0007 -0.0004 0.0013 1.4902 4.5598 13.0148 16.3968 29.4584 37.4473
frequency: 15.3756 29.3874 37.1632 46.4305 83.7423 85.3274 88.9924 116.8802 132.6484 145.6643 152.5758 157.3262 169.6330 202.8054 214.5184 228.1119 297.9640 328.0490 328.5085 401.3499 422.3019 439.3277 479.7653 512.7180 517.5452 607.8097 628.9996 721.3296 727.5959 730.4158 756.2477 771.4358 801.6558 828.6993 832.4132 835.9666 866.3308 888.8975 940.5317 954.0618 957.6002 980.2514 994.9210 998.2599 998.6017 1011.0868 1023.8498 1047.7659 1077.3884 1080.4085 1088.5698 1114.9770 1126.6062 1146.6397 1167.2835 1187.6224 1221.3493 1222.1389 1224.5753 1237.5321 1262.2871 1266.2234 1281.0668 1286.5932 1293.8469 1298.3361 1300.8404 1306.8997 1339.9728 1355.6524 1358.6231 1359.5837 1380.0576 1388.7071 1400.1563 1432.5381 1461.6714 1462.1685 1467.3422 1468.8091 1473.9522 1476.4042 1479.9428 1486.0794 1488.9815 1498.6777 1566.4722 1601.1610 1626.6205 2861.2033 2950.9288 2952.4967 2953.9727 2956.4807 2963.3040 2968.8732 2971.9362 2985.8514 2993.6941 2995.3750 3005.4666 3013.8263 3023.4594 3038.8491 3064.5970 3068.4859 3071.4982 3123.6769 3143.5094 3165.8662 3169.9856
redmass: 3.6010 4.1969 1.9950 3.7230 4.1346 3.2141 1.8254 4.3697 1.9017 2.3097 4.8362 2.1039 4.7147 3.2770 4.5705 1.1288 3.4513 4.4948 3.6436 3.7604 2.9428 4.2668 3.2505 2.5788 3.9847 7.2263 6.9852 1.0623 3.3302 1.0858 1.1144 5.5009 1.1685 1.2511 5.6599 1.5625 1.2022 1.9011 1.1924 1.3925 7.5143 1.3868 4.5837 1.6604 2.6511 1.1111 3.7152 3.1666 2.4612 2.2890 2.2753 1.3251 2.9171 1.4103 1.2327 1.6754 1.3369 2.1752 1.3971 3.9783 1.2670 1.3012 1.0299 1.1263 1.1023 1.1123 1.3474 1.3291 1.4158 1.6480 1.8491 1.8927 1.4492 1.2173 1.9445 4.3191 1.0726 1.0766 1.0696 1.0931 1.0951 1.0439 1.1029 1.1152 1.1205 2.1749 8.1359 5.9090 6.7960 1.0844 1.0589 1.0571 1.0584 1.0581 1.0591 1.0587 1.0365 1.0970 1.0993 1.0592 1.1022 1.1062 1.1048 1.1049 1.1053 1.1008 1.0993 1.0895 1.0883 1.0954 1.0954
irintensity: 0.2983 0.4014 0.1585 0.0205 0.8965 0.0317 1.1696 4.9191 2.7291 1.4444 2.7561 3.7458 1.3317 1.7675 3.8762 0.0067 0.1660 0.5746 7.0936 0.0023 1.1939 1.3689 0.9041 19.3266 5.9013 48.1495 5.7325 14.3329 0.1163 0.1671 6.2444 2.4478 0.9898 1.3004 31.6515 76.5413 0.0048 2.7490 0.6551 2.2443 99.0756 0.0516 3.6752 6.8975 1.6981 0.1324 8.8043 1.4500 2.2107 4.0461 19.7428 12.6573 10.6873 1.2117 175.5192 0.0059 13.1998 1.6576 0.1694 424.1716 0.0072 5.5525 0.0229 0.8926 0.1627 0.0007 12.6304 1.3329 0.2150 0.6199 5.9583 13.9126 15.9204 11.6584 65.0212 1.3660 0.2139 0.1142 1.6515 5.7036 17.8139 12.9299 5.7743 17.6632 40.1164 37.9899 62.8804 493.8661 44.7336 145.7790 0.1878 4.2355 11.6412 7.9918 24.6347 152.4909 37.7587 0.2097 1.0085 37.5316 2.5098 17.3476 0.7123 95.9327 78.8886 110.2331 54.4157 11.4901 1.5222 13.3248 5.4410
temp: 298.150 k
press: 1.00000 atm
elementType: 8 8 6 6 6 6 6 6 6 6 6 6 6 6 6 6 6 1 1 1 1 1 1 1 1 1 1 1 1 1 1 1 1 1 1 1 1 1 1
symmnumber: 1
zpe: 877741.6 jmol-1
zpe.correction: 0.334314 hartree
zpe.thermalcorrener: 0.353219 hartree
zpe.thermalcorrenthalpy: 0.354163 hartree
zpe.thermalcorrgfe: 0.284111 hartree
zpe.sumelectzpe: -733.918386 hartree
zpe.sumelectthermal: -733.899481 hartree
zpe.sumelectthermalent: -733.898537 hartree
zpe.sumelectthermalfe: -733.968589 hartree
dipole: -5.1956 1.4224 0.0819
dipole: 5.3874
quadrupole: -139.1700 -104.2723 -105.3450
quadrupole: 20.1387 -0.0842 -0.4732
quadrupole: -22.9076 11.9901 10.9174 20.1387 -0.0842 -0.4732
hfenergy: -734.2527001 hartree
pointgroup: C01 [X(C15H22O2)]
dipole: 2.0437743 0.4841907 -0.2847561 debye
polarizability: 279.2553943|8.0948064|150.4453982|-10.3883932|-18.7093411|110.1880139 unknown
InChI: InChI=1S/C15H22O2/c1-2-3-4-5-6-7-12-17-15-10-8-14(13-16)9-11-15/h8-11,13H,2-7,12H2,1H3
charge 0 multiplicity 1
39 atoms
O  -1.044615 0.882123 -0.385513
O  -7.083403 -1.311906 0.795036
C  3.912574 0.323088 -0.272853
C  5.119696 -0.578577 0.069305
C  2.549013 -0.357097 -0.013897
C  6.481593 0.112072 -0.169378
C  1.354186 0.566767 -0.345022
C  7.692144 -0.78257 0.182057
C  0.010705 -0.103002 -0.054016
C  9.047294 -0.079488 -0.04949
C  -2.375695 0.527363 -0.177918
C  -3.328862 1.529764 -0.504304
C  -2.802452 -0.735591 0.323519
C  -4.695563 1.270248 -0.327514
C  -4.175382 -0.980036 0.495506
C  -5.138785 0.013802 0.175023
C  -6.582974 -0.238173 0.355941
H  3.972595 1.257008 0.323853
H  3.972955 0.630013 -1.337675
H  5.069127 -1.508156 -0.535587
H  5.052056 -0.894795 1.131477
H  2.495876 -0.669348 1.050173
H  2.48415 -1.286733 -0.616994
H  6.554716 0.424728 -1.232165
H  6.530189 1.044095 0.432018
H  1.386278 0.86087 -1.411487
H  1.423005 1.498669 0.248213
H  7.647467 -1.711165 -0.423113
H  7.615074 -1.099148 1.242429
H  -0.072332 -0.3826 1.016504
H  -0.12907 -1.012139 -0.674299
H  9.129138 0.834909 0.568087
H  9.162488 0.220453 -1.108278
H  9.896098 -0.739001 0.208941
H  -2.967572 2.488314 -0.888012
H  -2.077298 -1.514793 0.574644
H  -5.433853 2.042522 -0.577927
H  -4.532367 -1.94197 0.880329
H  -7.244098 0.619982 0.067685
