program: Gaussian 09
title: 000090328
version: EM64L-G09RevD.01
frameworkgroup: C1[X(C7H9N3)]
method: RPBEPBE
basis: SDD
operation: Freq
keyword: #p
keyword: freq=noraman
keyword: PBEPBE/SDD
title: #p freq=noraman PBEPBE/SDD
converged: YES YES NO NO
title: Mulliken charges:
elementType: N N N C C C C C C C H H H H H H H H H
charge: -0.158265 -0.114322 -0.004526 -0.391456 0.239766 -0.418276 -0.203059 -0.757091 -0.330881 -0.139468 0.248539 0.252381 0.265369 0.271309 0.257947 0.232448 0.221593 0.274600 0.253392
chargesum: 0.00000
title: Mulliken charges with hydrogens summed into heavy atoms:
elementType: N N N C C C C C C C
charge: -0.158265 -0.114322 -0.004526 0.109464 0.239766 0.118402 0.054888 -0.028450 -0.077489 -0.139468
polarizability: 1.18372203e+02 4.36464570e+00 8.73937901e+01 1.00754802e+01 -2.27951183e-01 5.63138464e+01
1716.lowfreq: -0.0007 -0.0002 0.0005 7.0354 8.5981 16.1551 48.8036 67.5448 82.6893
frequency: 48.8030 67.4855 82.6861 120.9917 170.1062 232.0691 266.1075 349.7593 372.7305 418.2465 481.7344 627.2405 657.1647 670.4213 732.1384 745.7628 774.3960 844.3877 894.5885 945.2976 964.3503 1011.8444 1017.6017 1044.2952 1065.9272 1120.8182 1152.0818 1211.8172 1262.4325 1275.2675 1285.6009 1357.7877 1359.2966 1394.6527 1398.5644 1449.5823 1459.9942 1471.9065 1472.8926 1493.6269 1508.0924 2202.5458 2973.9609 3007.4431 3031.7410 3044.8057 3061.7093 3097.3299 3119.5867 3220.7990 3249.3720
redmass: 4.5555 2.4729 4.4762 1.1222 6.7033 3.1910 2.4202 4.5441 3.6188 2.7132 7.1440 3.4602 4.4988 4.5681 1.3011 3.7050 1.2928 1.3669 5.7714 4.6228 1.6726 3.1369 2.5512 1.4695 1.4287 1.9883 1.8532 2.0832 1.8761 1.5937 1.3181 1.6841 1.7306 2.1706 1.4044 1.0889 1.3924 1.0823 1.7007 1.4472 4.6826 12.4343 1.0400 1.0592 1.0600 1.0979 1.1017 1.1060 1.0952 1.0908 1.1089
irintensity: 7.0140 3.8481 9.3568 0.4378 2.3745 5.1710 1.9540 6.1259 1.6044 4.7016 4.6170 1.4299 10.7918 9.3690 65.2391 8.2512 3.0024 7.6599 0.5017 0.8763 12.1097 1.4648 1.4264 3.0179 11.8380 7.1253 10.8946 2.8650 33.0944 31.3294 4.8807 16.6473 19.2645 44.6510 33.5442 5.3740 15.0097 10.9142 17.1399 18.7373 22.4559 11.8308 30.3853 1.5242 24.1450 22.3991 0.4169 10.7163 6.0638 1.6467 4.9752
temp: 298.150 k
press: 1.00000 atm
elementType: 7 7 7 6 6 6 6 6 6 6 1 1 1 1 1 1 1 1 1
symmnumber: 1
zpe: 396501.3 jmol-1
zpe.correction: 0.151019 hartree
zpe.thermalcorrener: 0.160950 hartree
zpe.thermalcorrenthalpy: 0.161894 hartree
zpe.thermalcorrgfe: 0.114661 hartree
zpe.sumelectzpe: -435.635982 hartree
zpe.sumelectthermal: -435.626052 hartree
zpe.sumelectthermalent: -435.625107 hartree
zpe.sumelectthermalfe: -435.672340 hartree
dipole: -0.0139 -0.5874 0.3498
dipole: 0.6838
quadrupole: -91.9355 -51.8318 -59.0498
quadrupole: 1.0558 -2.7409 0.2968
quadrupole: -24.3298 15.7739 8.5559 1.0558 -2.7409 0.2968
hfenergy: -435.7870017 hartree
pointgroup: C01 [X(C7H9N3)]
dipole: -0.0123689 -0.2349777 0.1304144 debye
dipolederiv: -0.9281721 0.0150546 -0.1208997 -0.0890327 -0.1506963 -0.0294278 -0.2178171 0.003078 -0.1869245 -0.6021946 -0.0598113 -0.0503923 -0.0623279 -0.3824734 0.0095145 -0.1050785 -0.0222258 -0.2795096 -0.3329695 0.0067534 0.0267777 -0.012009 -0.2235523 0.0023656 -0.0699519 0.0018932 -0.2180905 0.7801149 -0.0236072 -0.0311926 0.0353661 0.1895032 -0.0007844 -0.0985096 -0.0169217 0.2850614 0.5908549 -0.0035847 0.1345401 -0.2881218 0.3791977 -0.0320413 0.2042398 0.0317697 0.0271808 -0.1576343 -0.0108337 -0.0222825 -0.0159052 0.2054864 -0.0057304 0.0476639 -0.0094279 0.0837776 0.186408 0.0769914 0.0975467 0.3217549 -0.1307366 0.0402756 0.1511912 -0.006916 -0.1781863 0.0090931 -0.0353563 -0.0327993 0.0334363 -0.0963016 0.0079514 -0.0501454 -0.0258746 0.1024574 -0.0069296 0.0804824 0.0798308 0.0970961 0.137764 -0.0093677 0.051145 0.0162971 -0.1538911 0.2008142 0.0096435 0.0465626 0.0356725 -0.0511489 -0.0010068 0.2108116 0.0000352 -0.0682185 0.0247252 -0.0095724 0.0126657 -0.0510055 -0.0317158 -0.100471 0.022256 -0.0563126 0.0413549 -0.0087066 0.0114666 -0.0116768 0.056917 -0.0086493 0.1128529 -0.0122382 0.064547 0.0049334 0.0474005 0.0222758 -0.028115 0.01159 0.022415 0.092739 -0.03222 0.0572486 0.0480488 0.0556338 -0.0282574 -0.0130508 -0.0157714 -0.0023078 -0.0798243 -0.0150586 -0.0410945 0.0783258 0.0819054 0.089919 -0.05285 0.0479551 0.0148065 0.0201888 -0.0596033 0.0360541 0.2035361 0.0934847 -0.0603388 -0.065934 -0.0354906 0.0094639 -0.0198484 -0.0584541 -0.09142 -0.0977981 -0.0564067 -0.1001959 0.1201141 -0.0464663 0.0229062 -0.0100656 0.1267292 0.0386899 0.0154334 -0.0032684 0.1169201 -0.0453818 0.0406625 0.067705 0.0162204 -0.044843 0.0417094 0.1142449 0.0258471 -0.097949 -0.0434629 -0.0643199 0.0283338 -0.0135407 -0.050117 -0.021129 0.1782643 unknown
polarizability: 118.5646613|3.1471637|87.1697111|10.2711329|0.4394894|56.3454667 unknown
InChI: InChI=1S/C7H9N3/c1-7-9-4-6-10(7)5-2-3-8/h4,6H,2,5H2,1H3
charge 0 multiplicity 1
19 atoms
N  -0.61286 -0.272663 0.328755
N  -2.702055 0.306488 -0.329561
N  4.291251 -0.073192 0.039028
C  0.806013 -0.165289 0.677454
C  -1.487701 0.783047 0.022258
C  1.709372 -0.251449 -0.593049
C  -1.324262 -1.472275 0.144194
C  -1.115369 2.233399 0.107225
C  -2.604601 -1.093979 -0.255357
C  3.138449 -0.153611 -0.257731
H  0.981643 0.79423 1.192255
H  1.075768 -0.973338 1.378647
H  1.444396 0.560111 -1.295874
H  1.521848 -1.20704 -1.116918
H  -0.87383 -2.444999 0.327258
H  -0.853425 2.541303 1.137669
H  -0.264391 2.498095 -0.54923
H  -1.987928 2.823344 -0.211784
H  -3.456518 -1.728882 -0.486338
