program: Gaussian 09
title: 000090369
version: EM64L-G09RevD.01
frameworkgroup: C1[X(C17H18O2)]
method: RPBEPBE
basis: SDD
operation: Freq
keyword: #pfreq=noraman
keyword: PBEPBE/SDD
title: #p freq=noraman PBEPBE/SDD
converged: YES YES NO NO
title: Mulliken charges:
elementType: O O C C C C C C C C C C C C C C C C C H H H H H H H H H H H H H H H H H H
charge: -0.309066 -0.208759 0.041315 0.448902 0.426392 -0.754381 -0.753708 -0.364705 -0.405022 -0.380336 -0.419701 -0.371449 -0.376405 0.409887 -0.243231 -0.241875 -0.247784 0.233034 -0.740355 0.211010 0.230837 0.233829 0.236410 0.208161 0.233020 0.253113 0.246836 0.251193 0.242892 0.242993 0.241542 0.226469 0.222362 0.227581 0.250743 0.247288 0.250966
chargesum: 0.00000
title: Mulliken charges with hydrogens summed into heavy atoms:
elementType: O O C C C C C C C C C C C C C C C C C
charge: -0.309066 -0.208759 0.041315 0.448902 0.426392 -0.078705 -0.076116 -0.111592 -0.158186 -0.129143 -0.176809 -0.128456 -0.134863 0.409887 -0.016762 -0.019513 -0.020203 0.233034 0.008642
polarizability: 2.39770216e+02 -6.55702587e+00 1.72355671e+02 1.53086609e+01 -2.17167828e+00 1.42874371e+02
1716.lowfreq: -36.2327 -0.0003 0.0002 0.0005 2.7955 3.5914 11.8213 31.3625 38.4294
frequency: -36.0495 31.2916 38.3066 47.7499 50.1549 77.8988 88.1279 128.3312 176.5102 207.6783 237.0699 255.6968 274.1176 302.7444 306.1964 321.8380 347.6611 356.6581 398.9781 402.9848 411.0708 440.5705 472.8387 529.2785 549.8250 556.4533 570.3086 615.9682 620.8575 633.9163 672.7770 707.4571 732.3849 752.5184 775.1510 791.7802 832.4702 843.0154 855.6561 872.8969 912.1107 927.6186 933.1071 957.1805 971.7818 979.6698 988.1853 990.2006 995.6181 1001.8614 1007.7940 1025.8784 1039.9848 1074.3027 1089.7574 1108.4266 1112.9747 1153.6322 1155.8615 1172.8363 1174.2874 1196.8660 1200.4234 1227.4399 1247.5028 1299.6856 1322.5079 1365.8061 1373.5180 1378.1479 1383.1375 1394.2793 1403.3853 1433.5471 1453.3851 1453.6039 1463.5395 1470.9459 1481.6637 1486.4403 1486.9248 1493.5225 1588.5301 1593.7059 1610.2975 1612.4099 1679.2848 2977.2220 2980.7173 3009.9307 3072.2601 3075.7540 3084.1365 3086.6388 3098.1769 3118.7925 3124.7156 3133.4355 3138.6821 3145.3353 3148.5784 3149.6961 3162.3818 3163.0686 3170.1864
redmass: 7.7884 5.0874 3.6013 2.9741 1.5405 2.4308 3.3924 4.2185 3.5940 4.4324 2.8400 3.4634 1.2738 1.8575 1.3495 2.8585 3.8146 3.3575 4.5808 2.8347 2.9049 3.9554 3.3473 4.1553 3.0099 3.1815 3.2171 5.6826 4.2972 7.1224 4.7049 1.6334 4.0010 3.7435 2.1153 2.9664 1.2781 2.1176 1.2517 4.0463 1.9315 1.6617 1.4867 1.3807 1.3727 1.3911 2.0295 4.7994 1.3624 1.4897 2.4475 2.5026 1.6494 1.7668 1.9466 1.5613 1.9701 2.6363 2.6315 1.0549 2.0760 1.1241 1.6696 3.3975 3.3847 1.2744 1.3569 6.4398 1.5721 3.0053 1.2378 1.2210 3.2454 2.2133 1.0543 1.0498 1.0706 1.1446 1.3307 1.0859 1.4729 2.0584 6.1168 7.3332 6.2141 6.2072 10.1601 1.0349 1.0356 1.0366 1.0996 1.0996 1.1000 1.0997 1.0973 1.0849 1.0873 1.0885 1.0925 1.1013 1.0877 1.0947 1.0959 1.1011 1.0966
irintensity: 0.6477 0.4036 0.5037 0.7628 1.7368 1.5463 1.1353 1.1926 0.4654 1.2711 0.9888 2.1206 0.0962 0.1875 0.1130 0.7249 1.1421 0.1558 2.3666 0.1158 0.1414 2.4740 2.5469 7.7505 24.0121 4.2021 14.5314 1.7495 11.7257 0.2892 1.5303 58.6233 0.7535 2.8611 33.4200 9.3409 2.5964 36.4184 0.1231 89.0599 3.8786 2.8539 3.9619 0.6014 0.0985 0.3044 111.0902 0.4328 0.3524 3.4220 33.1883 15.8799 8.2667 19.9196 12.6888 7.3456 2.3904 327.0326 18.5934 0.8013 230.0023 0.9207 2.7448 9.2541 27.1584 0.7368 1.1872 2.3663 16.2162 5.5017 62.9625 10.9764 5.9968 9.7196 24.9544 20.6479 5.7518 9.2982 1.3202 26.5011 9.4212 93.7876 1.1179 3.1444 9.9147 5.7594 167.8776 24.1409 27.3638 2.1100 7.5456 61.3679 31.9908 37.5298 6.6018 5.1979 0.8448 9.9438 24.2776 11.0849 6.9025 37.3732 11.7763 21.1899 5.6400
temp: 298.150 k
press: 1.00000 atm
elementType: 8 8 6 6 6 6 6 6 6 6 6 6 6 6 6 6 6 6 6 1 1 1 1 1 1 1 1 1 1 1 1 1 1 1 1 1 1
symmnumber: 1
zpe: 789538.1 jmol-1
zpe.correction: 0.300719 hartree
zpe.thermalcorrener: 0.318087 hartree
zpe.thermalcorrenthalpy: 0.319031 hartree
zpe.thermalcorrgfe: 0.254363 hartree
zpe.sumelectzpe: -807.689621 hartree
zpe.sumelectthermal: -807.672253 hartree
zpe.sumelectthermalent: -807.671309 hartree
zpe.sumelectthermalfe: -807.735977 hartree
dipole: 0.0415 -1.4555 -0.9182
dipole: 1.7214
quadrupole: -95.7200 -110.9224 -110.2723
quadrupole: -1.8747 0.1212 -5.5698
quadrupole: 9.9183 -5.2842 -4.6341 -1.8747 0.1212 -5.5698
hfenergy: -807.9903398 hartree
pointgroup: C01 [X(C17H18O2)]
dipole: -0.0501978 0.5886338 -0.331162 debye
polarizability: 239.3808693|-2.678861|171.6851552|-17.96028|2.9915614|143.9342337 unknown
InChI: InChI=1S/C17H18O2/c1-13(18)19-16-11-9-15(10-12-16)17(2,3)14-7-5-4-6-8-14/h4-12H,1-3H3
charge 0 multiplicity 1
37 atoms
O  -3.985856 0.10735 -0.407579
O  -3.895012 -1.861636 0.870565
C  1.658692 1.393462 0.16259
C  0.157514 1.01726 0.079722
C  2.533652 0.123761 -0.001396
C  1.9321 2.449656 -0.950049
C  2.031903 2.036328 1.531976
C  -0.29513 0.209358 -0.999086
C  -0.80637 1.492528 1.003452
C  2.244508 -1.023351 0.787494
C  3.656164 0.070517 -0.865251
C  -1.656662 -0.116542 -1.153952
C  -2.176803 1.173693 0.863935
C  -2.586046 0.372595 -0.215176
C  3.047969 -2.180076 0.718738
C  4.46491 -1.088728 -0.938943
C  4.167042 -2.218674 -0.146845
C  -4.548765 -1.05685 0.183633
C  -6.018987 -1.127652 -0.164226
H  2.966649 2.83496 -0.892923
H  1.767574 2.031978 -1.959269
H  1.245909 3.305657 -0.823305
H  3.118674 2.229333 1.56342
H  1.513808 3.001877 1.680756
H  1.78491 1.368928 2.376668
H  0.433768 -0.185294 -1.715932
H  -0.499335 2.113911 1.849558
H  1.369786 -1.013327 1.448931
H  3.910674 0.930813 -1.492651
H  -1.998942 -0.742402 -1.984152
H  -2.917735 1.539454 1.581927
H  2.799921 -3.051931 1.334785
H  5.326174 -1.106251 -1.616988
H  4.792312 -3.116734 -0.20457
H  -6.536484 -0.220358 0.1920
H  -6.467334 -2.019554 0.295975
H  -6.146252 -1.16686 -1.259832
