program: Gaussian 09
title: 000090329
version: EM64L-G09RevD.01
frameworkgroup: C1[X(C9H9NO2)]
method: RPBEPBE
basis: SDD
operation: Freq
keyword: #pfreq=noraman
keyword: PBEPBE/SDD
title: #p freq=noraman PBEPBE/SDD
converged: NO NO NO NO
title: Mulliken charges:
elementType: O O N C C C C C C C C C H H H H H H H H H
charge: -0.263355 -0.264465 -0.068874 0.269993 -0.005914 -0.503474 0.345810 -0.299840 0.218680 -0.349756 -0.762524 -0.535404 0.264724 0.255229 0.254337 0.246042 0.246030 0.258937 0.222937 0.222938 0.247951
chargesum: 0.00000
title: Mulliken charges with hydrogens summed into heavy atoms:
elementType: O O N C C C C C C C C C
charge: -0.263355 -0.264465 -0.068874 0.269993 -0.005914 -0.238750 0.345810 -0.044611 0.218680 -0.095420 -0.011515 0.158421
polarizability: 1.72246014e+02 -3.84554285e+00 1.08998666e+02 1.71101565e-02 -3.07667839e-03 5.43068355e+01
1716.lowfreq: -2.5088 -1.9864 -0.0003 -0.0002 0.0003 0.8168 82.9146 102.1916 118.5445
frequency: 82.9077 102.1886 118.5408 174.6259 198.2519 237.4275 268.5182 281.3406 366.4169 389.6342 436.0690 447.7292 510.2973 566.3077 620.7729 628.5224 671.2183 737.2812 749.8988 807.9413 823.5066 836.1157 838.5068 912.9292 956.3109 984.8365 1004.9395 1046.9142 1080.2990 1111.5042 1119.9876 1154.5719 1174.5189 1197.8499 1264.1172 1269.7995 1385.2939 1398.9324 1429.1503 1445.6839 1454.8409 1461.5139 1465.8226 1472.0643 1475.6733 1561.5705 1614.2990 1632.8271 2959.0561 2996.8086 3046.0909 3075.0783 3131.0486 3131.1769 3162.6979 3182.7877 3189.8712
redmass: 3.3073 1.2066 2.7186 3.2826 2.5137 1.5552 3.1253 3.6087 5.4354 5.5467 2.9236 4.9190 4.0878 5.4705 5.6920 3.4901 5.7777 6.8225 3.6558 5.7794 1.4641 1.6823 7.4492 5.1787 1.3312 3.7324 2.1655 1.4763 3.0035 1.2608 1.4364 1.4311 2.9963 3.0904 1.4019 6.8870 4.8570 1.2677 1.2980 3.2114 1.0441 1.1811 1.0497 2.3166 1.1509 7.7093 8.8570 7.9901 1.0332 1.0380 1.1039 1.0977 1.0992 1.0985 1.0883 1.0975 1.0925
irintensity: 3.8892 0.3472 0.5656 2.1343 8.6661 1.4188 7.0818 0.4531 0.1028 0.0919 6.2049 7.0518 1.0345 6.9567 2.7728 4.4042 2.7592 0.4465 0.2718 56.5215 13.1890 76.4762 7.8888 24.2337 0.1204 45.5608 3.2710 5.1450 98.6788 0.1836 32.0730 5.3840 28.0137 35.8351 4.8425 113.9530 5.9145 22.2832 30.4170 34.9516 18.4425 23.3030 13.6841 117.1032 1.4461 25.6692 42.1999 91.2427 59.3866 17.4238 48.4957 11.1591 23.5333 4.2120 2.3353 6.5538 2.7317
temp: 298.150 k
press: 1.00000 atm
elementType: 8 8 7 6 6 6 6 6 6 6 6 6 1 1 1 1 1 1 1 1 1
symmnumber: 1
zpe: 423746.5 jmol-1
zpe.correction: 0.161397 hartree
zpe.thermalcorrener: 0.171920 hartree
zpe.thermalcorrenthalpy: 0.172864 hartree
zpe.thermalcorrgfe: 0.125330 hartree
zpe.sumelectzpe: -552.672628 hartree
zpe.sumelectthermal: -552.662104 hartree
zpe.sumelectthermalent: -552.661160 hartree
zpe.sumelectthermalfe: -552.708694 hartree
dipole: -0.8395 -2.5513 0.0000
dipole: 2.6859
quadrupole: -58.9024 -65.9090 -72.0068
quadrupole: 1.3084 0.0031 0.0001
quadrupole: 6.7036 -0.3029 -6.4007 1.3084 0.0031 0.0001
hfenergy: -552.8340244 hartree
pointgroup: C01 [X(C9H9N1O2)]
dipole: 0.3176047 -1.0078505 0.0000038 debye
dipolederiv: -0.9565741 0.1017029 -0.0000525 -0.0596011 -0.5879937 0.0000144 -0.0001014 -0.0000036 -0.1150143 -1.6206112 0.4895488 -0.0001674 0.526281 -0.5403464 0.0000674 -0.0001064 0.0000635 -0.2993969 -0.3695987 -0.1300338 0.0000094 -0.0759091 -0.5108651 -0.0000434 -0.000039 -0.0000064 -0.2339722 0.4959578 -0.0277526 0.00001 0.3761783 0.2322329 0.0000066 -0.0000181 -0.0000174 0.0885556 0.1074917 0.0900939 -0.0000166 -0.081949 -0.1665151 -0.0000015 -0.0000305 -0.0000352 -0.0060002 -0.4071657 0.0667386 -0.0000112 -0.2204195 -0.0580372 -0.0000156 0.0000007 0.000025 -0.2271939 1.4891903 -0.3998814 0.0001614 -0.351593 0.2010762 -0.0000339 0.0001064 -0.0000223 0.0969204 0.3068703 0.0582758 0.0000576 0.0491063 0.168953 0.0000177 0.000071 0.0000092 -0.1201875 0.8265957 -0.0132479 0.0001164 -0.1461085 0.7633537 0.0000369 0.0006296 0.0002198 0.0486401 -0.3610951 0.0545942 -0.0000368 0.4507854 -0.0705527 0.0000622 -0.0000243 0.0000113 -0.1990108 -0.1680856 -0.0473573 0.0000215 -0.1519962 -0.0351852 -0.00003 -0.0006294 -0.0002626 0.0663117 0.4338552 -0.1421657 0.0000174 -0.5434968 0.5667238 -0.0000688 0.0000305 -0.0000238 0.3303815 0.0829057 0.0402365 -0.0000078 0.0620168 -0.0240729 0.0000004 -0.0000092 -0.0000026 0.1915915 0.0846264 0.0547582 -0.0000058 0.0248272 -0.0478394 -0.0000007 -0.0000101 0. 0.1662809 0.0050333 -0.087168 -0.000018 -0.0756727 0.0353569 -0.0000111 -0.0000229 -0.0000101 0.1739581 0.0207712 -0.0309114 0.0059079 -0.0560215 0.0521236 -0.097529 -0.0601873 -0.1063381 -0.0210026 0.0210855 -0.0306732 -0.0061235 -0.0559342 0.0515746 0.0977999 0.0600536 0.106599 -0.0203873 0.0191042 0.0418374 0.00012 0.117404 -0.0011026 -0.0002798 0.000295 -0.0001774 0.133391 0.0750545 -0.0638873 -0.0960275 0.1066544 -0.056313 -0.0783496 -0.0283962 -0.1022309 -0.0888313 0.0750132 -0.0639181 0.0960978 0.1066219 -0.0562819 0.0783602 0.02844 0.1021978 -0.088801 -0.1604246 0.0392106 -0.0000524 -0.0011739 0.0837105 -0.0000023 -0.000052 0.0000047 0.1237671 unknown
polarizability: 172.3329712|3.0464401|108.9117085|0.0171476|0.0028606|54.3068355 unknown
InChI: InChI=1S/C9H9NO2/c1-6-10-8-4-3-7(11-2)5-9(8)12-6/h3-5H,1-2H3
charge 0 multiplicity 1
21 atoms
O  -1.574031 -1.288949 -0.00047
O  3.277811 -0.102479 -0.000009
N  -2.238509 0.935336 -0.000492
C  -0.407566 -0.48898 -0.000372
C  -0.815041 0.870759 -0.000377
C  0.924984 -0.919782 -0.000251
C  1.891983 0.11941 -0.000138
C  0.16543 1.886821 -0.000264
C  -2.647488 -0.321464 -0.000568
C  1.516451 1.497924 -0.000148
C  -4.032337 -0.8677 -0.000842
C  3.74141 -1.49227 0.000172
H  1.188228 -1.978995 -0.000256
H  -0.12105 2.941937 -0.000272
H  2.320152 2.2395 -0.000057
H  -4.212886 -1.494942 -0.89216
H  -4.212071 -1.497792 0.888605
H  -4.745387 -0.03008 0.000744
H  3.397326 -2.030659 -0.90463
H  3.39697 -2.030541 0.904908
H  4.838821 -1.428956 0.000379
