program: Gaussian 09
title: 000090331
version: EM64L-G09RevD.01
frameworkgroup: C1[X(C10H6Cl6O)]
method: RPBEPBE
basis: SDD
operation: Freq
keyword: #p
keyword: freq=noraman
keyword: PBEPBE/SDD
title: #p freq=noraman PBEPBE/SDD
converged: NO YES NO NO
title: Mulliken charges:
elementType: Cl Cl Cl Cl Cl Cl O C C C C C C C C C C H H H H H H
charge: 0.056401 0.067582 0.125170 0.103653 0.060548 0.064481 -0.432330 -0.179804 -0.170596 -0.172006 -0.172949 -0.498645 -0.199940 0.001999 0.002409 -0.255469 -0.175306 0.347551 0.329512 0.231383 0.263979 0.255599 0.346778
chargesum: 0.00000
title: Mulliken charges with hydrogens summed into heavy atoms:
elementType: Cl Cl Cl Cl Cl Cl O C C C C C C C C C C
charge: 0.056401 0.067582 0.125170 0.103653 0.060548 0.064481 -0.085553 0.167747 0.158916 -0.172006 -0.172949 -0.498645 0.031443 0.001999 0.002409 0.008510 0.080293
polarizability: 1.67736692e+02 -9.89016372e+00 1.57233003e+02 1.06527313e+01 -1.49224140e+00 1.43924312e+02
1716.lowfreq: -7.9328 -5.8804 -0.0014 0.0020 0.0028 5.3607 68.1041 77.8424 89.8166
frequency: 68.0657 77.8375 89.8085 103.4623 115.8268 128.1726 143.2811 148.2740 154.0792 165.5115 181.2944 231.6264 252.9599 277.7684 289.5068 295.4049 321.5922 332.8781 346.0819 372.2316 397.6642 471.0182 511.1788 560.3820 590.1203 642.9303 656.9597 698.6047 725.5727 763.6504 792.2900 821.6339 851.2946 857.0276 889.9305 939.8126 949.5450 968.5568 984.7552 1000.4191 1025.5622 1046.0450 1066.9651 1085.0667 1091.5531 1112.5762 1139.9043 1182.7260 1204.6859 1241.8033 1259.0716 1276.1094 1307.7260 1324.4289 1375.7854 1605.6942 1632.2975 2973.8059 3044.6219 3082.3154 3162.8638 3194.4463 3553.9396
redmass: 6.7960 13.9947 11.8131 11.1593 15.5050 15.9679 24.2921 24.7051 33.8148 16.7689 13.3431 10.5493 6.6799 1.2067 6.9343 5.2029 15.5711 16.0080 27.1459 12.3111 4.1391 4.8928 7.2677 7.1973 10.3310 9.0066 6.1708 6.1793 6.9763 2.6375 3.0272 4.4893 8.1115 6.2960 4.1052 2.2532 2.2376 2.0578 5.4069 7.1049 4.1916 6.6909 3.1024 2.8209 2.4657 1.2327 5.0111 1.1624 1.6400 1.5165 1.4024 1.4241 1.6442 1.5158 1.5712 12.0126 6.8541 1.0841 1.0850 1.0861 1.0872 1.1068 1.0664
irintensity: 0.7391 0.2873 0.9497 0.6449 0.2740 0.3026 0.4625 0.2196 0.0347 0.6885 0.5995 2.3483 2.0201 123.5582 25.0728 2.9270 3.0206 1.6504 0.1945 5.2301 2.3388 4.3744 2.0139 48.0453 7.0943 45.0387 30.8872 56.1294 32.1357 27.3190 11.8385 44.1501 8.5001 11.8210 6.1223 12.0383 22.2650 17.3455 76.8328 29.4129 54.3237 51.1283 3.8441 2.6808 6.7922 21.5035 28.0203 38.1806 15.7861 44.2604 8.9148 6.2680 13.5834 4.8091 8.1459 50.1221 2.4050 20.6038 2.5089 0.5172 0.7120 10.8302 9.6042
temp: 298.150 k
press: 1.00000 atm
elementType: 17 17 17 17 17 17 8 6 6 6 6 6 6 6 6 6 6 1 1 1 1 1 1
symmnumber: 1
zpe: 353849.4 jmol-1
zpe.correction: 0.134774 hartree
zpe.thermalcorrener: 0.151520 hartree
zpe.thermalcorrenthalpy: 0.152464 hartree
zpe.thermalcorrgfe: 0.089962 hartree
zpe.sumelectzpe: -3218.928378 hartree
zpe.sumelectthermal: -3218.911633 hartree
zpe.sumelectthermalent: -3218.910689 hartree
zpe.sumelectthermalfe: -3218.973190 hartree
dipole: 1.8902 0.9311 -0.5449
dipole: 2.1764
quadrupole: -140.1332 -137.4957 -142.0554
quadrupole: -2.6582 4.7451 -0.1582
quadrupole: -0.2384 2.3991 -2.1606 -2.6582 4.7451 -0.1582
hfenergy: -3219.0631526 hartree
pointgroup: C01 [X(C10H6Cl6O1)]
dipole: 0.8170615 0.1712388 0.1904623 debye
dipolederiv: -0.127841 0.0396654 -0.0032877 0.0302612 -0.5800809 0.1298834 0.0075327 0.1308809 -0.1333568 -0.3027432 0.1982452 -0.1453974 0.1924274 -0.295718 0.1583953 -0.142473 0.1714548 -0.2267583 -0.6206549 -0.1429418 0.1574145 -0.1416328 -0.1131807 -0.0060478 0.2265969 0.0203237 -0.2074915 -0.1722662 -0.028848 0.0277159 -0.0287305 -0.1968995 -0.2541348 0.0424617 -0.2444211 -0.6227836 -0.0351434 0.0655167 -0.1552029 0.0423023 -0.0400639 0.0481529 -0.1502418 0.1388149 -0.6175431 0.0017877 0.0987164 0.0327591 0.1486514 -0.5277573 -0.2268176 0.0819647 -0.3042422 -0.1700252 -0.9294947 0.2396871 -0.0445807 0.270234 -0.3429128 -0.1575353 0.030303 -0.2079788 -0.3895689 -0.2035324 0.0933632 -0.0393067 -0.0549557 -0.2285045 0.0014407 -0.1075989 -0.0031462 -0.0283618 0.0365996 0.0187763 -0.0565272 0.0753252 -0.0827116 0.1183641 -0.1627085 0.0879775 -0.0050008 0.0925278 0.0388668 -0.0294589 -0.1080097 0.8374834 -0.1629416 -0.0176349 -0.2217495 0.0151039 0.3633705 -0.3723913 0.3169461 -0.2867027 0.3010331 -0.32945 0.1996349 -0.3108602 0.2419878 0.837172 0.2526799 -0.2434052 0.2578218 0.2403209 0.376283 -0.2870711 0.3406257 0.9532276 0.7628494 -0.2562949 -0.0679153 -0.2958837 0.3890541 0.022515 -0.010135 0.1246028 0.2974218 -0.0502534 -0.1110233 0.2200638 -0.0474792 -0.2128036 -0.1864612 0.2363566 -0.1614204 0.7377491 -0.1213914 -0.1109971 -0.1803277 -0.1581588 0.6790757 0.3673712 -0.1301773 0.3937678 0.0231209 -0.0219866 0.0441742 0.0582522 0.1193145 0.0777821 -0.0609055 0.1935884 -0.001243 -0.140472 -0.0975336 0.0334907 0.1448274 0.1145531 -0.0359984 -0.0008608 0.0686435 -0.0196394 -0.1086305 0.0516411 0.0292711 0.0203007 0.0050118 0.0298992 -0.0250074 0.0087457 -0.0706793 0.0329412 0.0418519 -0.0043213 -0.0034806 -0.0326352 0.0680707 -0.0254419 -0.0253005 0.0115947 -0.0494307 0.001223 0.0295201 0.026385 0.0434142 -0.0061193 0.0625231 0.0247627 0.02021 -0.1136518 0.0976432 0.0025418 -0.0339311 -0.0384022 -0.0539216 0.0433792 -0.050912 0.0230623 0.1307219 0.0304162 -0.0822496 -0.0591283 -0.0940886 0.0308364 -0.0094496 -0.1023627 -0.0213141 0.1253132 0.3657585 -0.0754475 0.0572853 -0.0126378 0.0631164 0.1167456 0.0660251 0.1033792 0.2554877 unknown
polarizability: 153.0126034|-12.8305133|165.1142703|10.6978991|-4.1609187|150.7671334 unknown
InChI: InChI=1S/C10H6Cl6O/c11-6-7(12)9(14)5-3(1-2-4(5)17)8(6,13)10(9,15)16/h1-5,17H
charge 0 multiplicity 1
23 atoms
Cl -0.026025 -2.90958 0.75147
Cl -2.104994 1.90372 -1.558727
Cl -3.035555 -1.122628 0.081077
Cl -1.333385 -1.538526 -2.340845
Cl 0.061458 -0.446314 3.095112
Cl -1.205885 2.537898 1.660462
O  3.548633 -0.90878 -0.444894
C  1.0488 -0.642864 -0.62238
C  0.48544 0.695346 -1.255777
C  -0.152312 -1.141865 0.25384
C  -0.979987 0.769164 -0.6537
C  -1.378277 -0.754336 -0.6530
C  2.358028 -0.265604 0.139696
C  -0.374151 -0.145009 1.401268
C  -0.868524 0.998269 0.855927
C  1.466648 1.754086 -0.802502
C  2.477926 1.232922 -0.061758
H  1.269772 -1.387345 -1.402631
H  0.388672 0.643251 -2.353826
H  2.293842 -0.527749 1.216349
H  1.358867 2.806524 -1.078766
H  3.324406 1.788797 0.349885
H  3.607004 -1.839579 -0.108679
