program: Gaussian 09
title: 000090327
version: EM64L-G09RevD.01
frameworkgroup: C1[X(C9H13N3)]
method: RPBEPBE
basis: SDD
operation: Freq
keyword: #pfreq=noraman
keyword: PBEPBE/SDD
title: #p freq=noraman PBEPBE/SDD
converged: YES YES NO NO
title: Mulliken charges:
elementType: N N N C C C C C C C C C H H H H H H H H H H H H H
charge: -0.154741 -0.116788 -0.006340 0.215248 -0.406009 -0.480516 -0.365366 0.202411 -0.417547 -0.665833 -0.785323 -0.142034 0.249373 0.251719 0.199998 0.252064 0.268455 0.264907 0.271987 0.242957 0.224562 0.204167 0.238245 0.237062 0.217342
chargesum: 0.00000
title: Mulliken charges with hydrogens summed into heavy atoms:
elementType: N N N C C C C C C C C C
charge: -0.154741 -0.116788 -0.006340 0.215248 0.095083 -0.028454 -0.096911 0.202411 0.119347 0.005852 -0.092673 -0.142034
polarizability: 1.46789569e+02 6.78396333e+00 1.12281184e+02 8.67079400e+00 -5.98455240e+00 7.76357421e+01
1716.lowfreq: -12.2212 0.0005 0.0006 0.0007 3.3236 10.0535 40.4201 62.4942 67.2275
frequency: 40.3198 62.4504 67.2174 72.6376 101.2880 130.5880 163.8533 196.0016 237.2301 265.0822 276.7556 325.8170 374.2688 423.8479 457.1841 479.8733 592.3363 646.7020 664.2066 710.3345 741.6453 750.6268 776.9003 805.2061 943.9279 955.2438 970.3469 996.1342 1013.1532 1021.5378 1047.4568 1054.7580 1065.5483 1130.8643 1162.4128 1199.5414 1251.9471 1279.0172 1281.3108 1290.5241 1317.6253 1351.8069 1359.9016 1387.2720 1399.8145 1406.7900 1449.3109 1458.1426 1461.2020 1472.1198 1474.6514 1479.9734 1487.6305 1499.5888 1569.4778 2200.5389 2982.7227 2984.5825 2986.3793 3006.4109 3031.8802 3061.1827 3061.7157 3065.8779 3082.4889 3091.7915 3096.2358 3098.8587 3229.1263
redmass: 4.9587 2.2451 4.0091 3.0652 1.0600 3.4218 5.6583 1.2005 3.1584 2.5941 2.0238 3.4621 3.5273 5.1891 2.4982 6.6704 3.8434 2.8661 4.2384 5.0561 1.5584 1.5717 1.2656 2.1181 4.5728 2.8007 2.2789 1.9507 4.3630 1.9084 1.4934 1.9892 1.7158 2.0934 1.4502 1.7802 1.3104 1.3530 1.2811 4.8726 1.4363 1.6176 1.9895 1.2110 1.4339 2.3573 1.0943 1.0450 1.0892 1.1443 1.0792 1.2857 1.0931 2.7798 5.2635 12.4307 1.0380 1.0375 1.0630 1.0591 1.0605 1.1008 1.0962 1.0980 1.0982 1.0992 1.1014 1.1049 1.0999
irintensity: 3.8449 0.7454 4.9753 3.7930 0.0881 6.7270 4.9089 0.5884 5.7560 5.0963 0.5305 0.3561 1.3092 2.9039 1.7507 5.8039 1.6637 9.9850 8.6373 6.3293 30.6504 6.8848 3.2866 0.6992 0.9149 0.3266 11.0112 6.6855 3.7689 0.3506 6.2764 17.0512 18.9831 0.4311 16.6214 6.1667 1.4085 0.6447 3.1691 28.9740 1.4090 48.8946 1.4793 10.1765 15.0173 95.2075 4.6470 12.3459 26.5521 2.5132 12.2438 6.3458 13.1962 20.6670 13.4955 14.1088 37.4423 45.1863 24.7024 1.4540 21.9543 1.4258 3.6036 19.5062 53.6290 22.1911 28.1202 12.9807 0.5834
temp: 298.150 k
press: 1.00000 atm
elementType: 7 7 7 6 6 6 6 6 6 6 6 6 1 1 1 1 1 1 1 1 1 1 1 1 1
symmnumber: 1
zpe: 541795.9 jmol-1
zpe.correction: 0.206359 hartree
zpe.thermalcorrener: 0.219391 hartree
zpe.thermalcorrenthalpy: 0.220335 hartree
zpe.thermalcorrgfe: 0.165683 hartree
zpe.sumelectzpe: -514.090156 hartree
zpe.sumelectthermal: -514.077123 hartree
zpe.sumelectthermalent: -514.076179 hartree
zpe.sumelectthermalfe: -514.130832 hartree
dipole: -0.7943 -0.3845 0.4748
dipole: 1.0021
quadrupole: -102.1168 -65.3505 -71.6900
quadrupole: 5.7288 -3.4608 -0.8584
quadrupole: -22.3977 14.3686 8.0291 5.7288 -3.4608 -0.8584
hfenergy: -514.2965147 hartree
pointgroup: C01 [X(C9H13N3)]
dipole: -0.3130765 -0.1567366 0.1812603 debye
dipolederiv: -0.9899566 0.0378801 -0.1292816 -0.115409 -0.1393346 -0.0376773 -0.2202885 -0.0074183 -0.172908 -0.6749228 -0.0875673 -0.0533732 -0.2006035 -0.4304213 0.027178 -0.0603995 0.0291961 -0.2807656 -0.3563785 0.0314612 0.0245026 -0.021707 -0.2216108 0.0012835 -0.0717244 0.0118616 -0.2203093 0.534505 -0.0163585 0.1547897 -0.2419145 0.3590881 -0.1093889 0.2982686 -0.0767511 0.0142659 0.8040515 -0.0939609 -0.027775 -0.0869265 0.2189813 0.0241335 -0.0945325 0.0243937 0.2786469 0.1400549 -0.028194 -0.0380324 -0.019239 0.0237243 0.0099899 -0.0633939 -0.100359 0.0924076 0.1256924 -0.005287 0.0663516 0.329916 -0.2113333 -0.0016087 0.0444135 -0.0402564 -0.203534 0.3179568 0.2359523 0.054374 0.2875965 0.1982691 -0.0584725 0.006606 -0.0119996 0.0012677 -0.1800254 0.0204563 -0.0224294 0.0503843 0.1803701 -0.0349378 0.0511184 -0.0511382 0.096885 0.0494973 -0.0425764 0.0288646 -0.0167783 -0.0047164 -0.0332796 0.037897 0.0230483 0.0071222 -0.0699154 -0.1066919 0.0032613 -0.0274798 0.0488113 -0.003832 -0.0361084 -0.0211383 0.0687321 0.2316359 -0.0135251 0.0427239 0.0720979 -0.0641398 -0.0104787 0.2063913 -0.0279692 -0.0646702 0.0204761 -0.0311518 0.0083108 -0.0580127 -0.0634752 -0.0627043 0.0358606 -0.0236048 0.0700103 -0.0023931 0.0100228 -0.0009135 0.0631839 0.0335951 0.0966665 -0.0241386 0.0554917 -0.0497965 -0.1524457 -0.0239307 0.1265817 0.0113419 0.0054751 -0.0388428 0.088822 -0.0254162 0.0323644 0.0320934 0.0589661 -0.105642 0.0170527 0.0410518 0.0235372 -0.0620529 0.0397935 -0.0231119 0.0891674 0.0495195 -0.0637373 0.0185413 0.0243094 0.0747949 -0.0635 0.088132 0.1700092 0.0495635 0.0142393 -0.0247076 0.0003967 0.0670969 0.088934 -0.0305199 0.0556107 0.0056744 0.054605 -0.0393244 -0.0111471 -0.0278866 -0.0244322 -0.0438012 -0.0144764 -0.0062585 0.1057359 -0.0946361 0.0462775 0.089217 -0.006712 0.1052871 -0.0156272 0.0564916 -0.0202475 0.04852 0.0782215 -0.0928868 0.0164047 -0.0748664 -0.2129515 0.0288805 0.0159501 0.0305692 0.0636643 -0.0108872 0.0462488 -0.1226435 0.0753948 0.0561576 0.0725915 -0.1044643 0.0398351 -0.0613081 -0.0894025 0.0106071 0.0766715 0.0611 0.0465951 -0.067997 0.1144617 -0.0347451 0.0517842 0.0287507 -0.0462364 -0.0536547 -0.0569302 0.0833525 -0.0049794 -0.1079182 -0.0537048 -0.1047518 0.0646921 0.0660602 -0.0387159 -0.0325407 -0.1197499 0.0756382 -0.0027634 0.1030753 0.0740652 unknown
polarizability: 146.6731409|6.651032|112.5973241|9.1975737|-5.0209594|77.43603 unknown
InChI: InChI=1S/C9H13N3/c1-3-9-11-8(2)7-12(9)6-4-5-10/h7H,3-4,6H2,1-2H3
charge 0 multiplicity 1
25 atoms
N  -0.213813 -0.212446 0.330637
N  -2.246841 0.341626 -0.494746
N  4.672918 -0.674124 0.041403
C  -0.990105 0.786607 -0.27793
C  1.216767 -0.161105 0.640844
C  -0.500842 2.17764 -0.576028
C  -1.039781 -1.34408 0.481926
C  -2.290513 -0.987278 -0.023587
C  2.072224 -0.730722 -0.534862
C  -0.54623 3.120113 0.658194
C  -3.547793 -1.804272 -0.10139
C  3.511274 -0.706131 -0.229797
H  1.510436 0.882221 0.841378
H  1.414683 -0.742799 1.557598
H  0.525785 2.158269 -0.992871
H  -1.158386 2.581313 -1.364761
H  -0.680596 -2.263219 0.93819
H  1.88386 -0.141758 -1.451835
H  1.761564 -1.770141 -0.748464
H  -1.575311 3.179756 1.052222
H  -0.218764 4.138565 0.381819
H  0.108071 2.761211 1.474423
H  -4.366976 -1.320139 0.460825
H  -3.887949 -1.903396 -1.148359
H  -3.394483 -2.816111 0.311371
