program: Gaussian 09
title: 000090334
version: EM64L-G09RevD.01
frameworkgroup: C1[X(C12H12N2O)]
method: RPBEPBE
basis: SDD
operation: Freq
keyword: #p
keyword: freq=noraman
keyword: PBEPBE/SDD
title: #p freq=noraman PBEPBE/SDD
converged: YES YES NO NO
title: Mulliken charges:
elementType: O N N C C C C C C C C C C C C H H H H H H H H H H H H
charge: -0.305263 -0.050008 -0.631381 0.462687 -0.482962 0.191803 -0.392407 -0.363439 0.054863 -0.223935 -0.226645 -0.256246 -0.233698 -0.193873 -0.333585 0.223415 0.216706 0.238477 0.245400 0.257370 0.229786 0.228920 0.230727 0.227540 0.232752 0.331762 0.321232
chargesum: 0.00000
title: Mulliken charges with hydrogens summed into heavy atoms:
elementType: O N N C C C C C C C C C C C C
charge: -0.305263 -0.050008 0.021614 0.462687 -0.042840 0.191803 -0.153930 -0.118039 0.054863 0.005851 0.002275 0.001123 -0.002970 0.033667 -0.100833
polarizability: 1.68799113e+02 1.27922843e+01 1.50167139e+02 -2.30042505e+01 3.41496453e+00 1.01106279e+02
1716.lowfreq: -7.5584 -4.0965 -0.0008 -0.0007 -0.0006 9.9999 25.4243 32.4736 41.0892
frequency: 20.8554 30.6333 40.8944 104.5638 118.1708 179.1685 242.1460 302.8903 342.3903 364.0153 401.7351 428.1288 456.0730 469.3637 504.4424 515.6111 540.2896 567.4915 571.8388 608.7347 617.9288 701.4596 712.8290 757.3781 762.7805 790.0854 812.4350 844.2687 855.1393 890.0831 921.4058 926.7311 951.0534 969.4577 978.4070 985.0801 990.0416 998.6688 1027.1301 1054.9964 1091.5359 1110.5990 1159.2808 1173.7584 1188.2595 1218.0594 1223.7393 1262.0718 1321.8372 1325.8560 1341.1674 1350.0557 1387.1178 1428.3662 1442.5750 1460.9305 1472.4127 1485.0654 1552.4552 1569.1728 1595.5730 1607.4362 1614.1770 2991.7991 3078.4257 3121.9966 3125.0527 3129.9222 3137.0153 3149.2998 3155.9950 3165.2185 3176.4067 3546.3958 3702.5810
redmass: 4.9429 4.1476 4.9415 4.2664 5.0074 4.7545 4.2788 3.8318 2.3429 4.0945 2.7900 2.8993 1.9337 2.8058 1.9737 4.2219 1.4105 6.3856 3.5608 4.2558 6.2901 1.9449 4.2418 2.2105 2.6466 1.8283 3.3643 5.1076 1.2705 5.5436 1.3855 1.4980 1.3827 2.0145 1.3964 1.7850 5.9486 1.3340 2.1976 2.0579 1.5105 1.5833 2.1411 1.0553 1.1174 2.0116 1.4142 1.5932 2.2252 1.2843 1.2727 5.4986 7.8772 2.1434 2.1837 1.1947 2.8464 2.2931 6.3466 1.9999 6.0475 2.4289 6.1161 1.0627 1.1029 1.0859 1.0875 1.0885 1.0918 1.0964 1.0912 1.1016 1.0995 1.0435 1.1050
irintensity: 0.5213 0.0110 0.1168 2.8304 0.2106 2.9151 8.2840 13.8441 12.8348 4.2925 0.1120 54.7128 111.3012 64.9819 55.2065 4.6474 7.9149 3.3872 8.3950 13.9857 0.4108 41.5943 23.1630 67.6689 45.3476 18.4917 6.2814 28.7559 0.8964 56.0817 2.3036 0.2701 2.1771 8.9823 0.3201 2.9754 0.5110 0.0854 3.4664 6.4913 7.8384 55.6413 107.8579 0.2007 0.0862 10.4085 17.9251 7.0941 0.3511 1.4934 10.4050 11.4492 0.6804 14.1417 10.3825 4.2875 165.5410 4.0809 5.4661 15.8640 1.3985 347.9745 0.6468 42.5007 17.2676 4.9510 0.6620 15.4284 12.5811 36.4014 20.3912 20.2305 12.8230 71.5324 45.1791
temp: 298.150 k
press: 1.00000 atm
elementType: 8 7 7 6 6 6 6 6 6 6 6 6 6 6 6 1 1 1 1 1 1 1 1 1 1 1 1
symmnumber: 1
zpe: 563551.2 jmol-1
zpe.correction: 0.214645 hartree
zpe.thermalcorrener: 0.227532 hartree
zpe.thermalcorrenthalpy: 0.228476 hartree
zpe.thermalcorrgfe: 0.173166 hartree
zpe.sumelectzpe: -648.125715 hartree
zpe.sumelectthermal: -648.112829 hartree
zpe.sumelectthermalent: -648.111885 hartree
zpe.sumelectthermalfe: -648.167195 hartree
dipole: 2.4299 -0.8358 0.5972
dipole: 2.6381
quadrupole: -88.0949 -76.3661 -87.9588
quadrupole: 7.5345 -3.3295 -1.4037
quadrupole: -3.9549 7.7738 -3.8188 7.5345 -3.3295 -1.4037
hfenergy: -648.3403607 hartree
pointgroup: C01 [X(C12H12N2O1)]
dipole: -1.0003628 -0.2715791 0.0524877 debye
polarizability: 159.7411098|-28.878183|138.7753926|-17.7570806|-20.3047204|121.556028 unknown
InChI: InChI=1S/C12H12N2O/c13-12-11(7-4-8-14-12)15-9-10-5-2-1-3-6-10/h1-8H,9,13H2
charge 0 multiplicity 1
27 atoms
O  0.572695 -0.924425 1.376006
N  3.446082 -0.232913 -0.879055
N  2.864281 -2.150999 0.365898
C  -1.707706 -0.634585 0.341463
C  -0.61805 -1.603604 0.746376
C  1.397277 -0.203073 0.468409
C  -1.952315 -0.349618 -1.024699
C  -2.490016 0.016156 1.331287
C  2.577284 -0.855352 -0.025508
C  -2.962861 0.565858 -1.399522
C  -3.49611 0.93409 0.961299
C  1.141972 1.123455 0.092479
C  -3.736286 1.209858 -0.407005
C  2.046206 1.774775 -0.78784
C  3.166456 1.051762 -1.248377
H  -0.956215 -2.281224 1.548525
H  -0.271336 -2.199374 -0.120457
H  -1.347085 -0.841265 -1.795976
H  -2.299442 -0.194032 2.390547
H  0.25616 1.632696 0.484229
H  -3.143026 0.777112 -2.459375
H  -4.094782 1.43064 1.733153
H  -4.519987 1.919655 -0.694846
H  1.881955 2.808985 -1.103399
H  3.886055 1.509217 -1.937222
H  2.325673 -2.571135 1.119391
H  3.72992 -2.572861 0.038721
