program: Gaussian 09
title: 000090372
version: EM64L-G09RevD.01
frameworkgroup: C1[X(C16H6Br6O4)]
method: RPBEPBE
basis: SDD
operation: Freq
keyword: #p
keyword: freq=noraman
keyword: PBEPBE/SDD
title: #p freq=noraman PBEPBE/SDD
converged: YES YES NO NO
title: Mulliken charges:
elementType: Br Br Br Br Br Br O O O O C C C C C C C C C C C C C C C C H H H H H H
charge: 0.075639 0.075531 0.075626 0.075545 0.056798 0.056807 -0.288163 -0.288092 -0.173282 -0.173281 0.616074 0.616222 -0.339052 -0.339149 -0.339098 -0.339101 -0.154219 -0.154231 -0.154262 -0.154259 -0.226451 -0.226481 0.218203 0.218201 -0.216146 -0.216165 0.279554 0.279561 0.279552 0.279557 0.289278 0.289286
chargesum: 0.00000
title: Mulliken charges with hydrogens summed into heavy atoms:
elementType: Br Br Br Br Br Br O O O O C C C C C C C C C C C C C C C C
charge: 0.075639 0.075531 0.075626 0.075545 0.056798 0.056807 -0.288163 -0.288092 -0.173282 -0.173281 0.616074 0.616222 -0.339052 -0.339149 -0.339098 -0.339101 0.125335 0.125331 0.125290 0.125297 -0.226451 -0.226481 0.218203 0.218201 0.073132 0.073121
polarizability: 4.76482007e+02 -3.90872425e-02 3.06921924e+02 3.23810818e+01 -1.52779927e-02 1.27245296e+02
1716.lowfreq: -5.3145 -4.0137 -2.4937 -2.1200 -0.0005 -0.0003 0.0003 4.0609 8.7864
frequency: -4.0159 4.0608 8.3050 12.7999 22.3746 33.9435 38.8881 56.7836 58.7294 98.7201 99.0840 111.2009 111.3063 115.9964 129.8670 147.7271 153.2736 154.1529 158.6782 179.0906 179.1288 222.3268 222.5234 261.5414 261.9239 267.0720 267.1992 328.6010 346.5312 349.9594 350.2971 371.1059 463.2943 500.5359 500.5797 521.6794 530.6331 539.3692 542.0621 592.0451 616.1347 647.5923 661.7394 668.8098 705.9216 712.2410 714.0808 738.8379 763.9172 790.4549 807.1269 866.9348 866.9451 876.9383 876.9474 882.2438 917.9642 949.5984 1008.0807 1025.3347 1030.2291 1061.8845 1084.7303 1095.9403 1100.4301 1191.5601 1191.6242 1204.2445 1207.9648 1271.4405 1288.0964 1344.9790 1345.1936 1357.9538 1358.1497 1409.5336 1409.8648 1547.3177 1547.7551 1557.0897 1557.4280 1656.7684 1658.0507 1661.4694 3164.2444 3168.3940 3187.1052 3187.1205 3189.0406 3189.0826
redmass: 30.9561 42.4810 27.2050 34.2325 49.7819 14.0482 14.9989 13.6137 39.3370 16.8422 13.7270 41.3622 42.4259 27.9888 15.3848 13.9877 8.5501 11.6157 2.6860 4.6385 4.6387 72.7418 74.6801 10.2540 8.6986 10.6895 14.1409 10.3707 9.8366 7.6785 7.6877 10.7086 5.8873 4.9865 4.9856 6.3717 7.6498 5.5125 5.1345 4.8283 7.3216 7.3983 6.2068 7.0961 10.6980 10.3007 10.3841 8.4677 8.8970 9.3394 7.6296 1.4517 1.4479 1.3675 1.3677 9.4429 2.1032 5.0788 1.0880 6.7194 6.0486 4.7138 2.4157 2.5900 2.8401 1.5523 1.5511 2.8782 3.1813 1.7791 1.4677 4.7132 4.7460 4.7882 4.7750 3.1187 3.1291 9.5906 9.5848 8.3082 8.3466 12.3392 7.6545 9.3888 1.0999 1.0870 1.0932 1.0932 1.0940 1.0940
irintensity: 0.0354 0.0056 0.0000 0.0298 0.0000 0.0000 0.2331 0.2154 0.0000 0.0001 1.3098 0.0000 0.0235 0.0310 0.0000 0.0001 3.9323 3.9918 0.0003 0.0068 0.0447 0.2271 0.0011 0.0000 0.0003 22.8068 1.7446 0.0001 11.8886 0.0683 8.7585 0.0000 9.7425 0.0007 0.0004 0.0001 12.0678 20.9351 0.0008 0.0000 14.7092 0.0000 31.4825 0.0001 0.5014 0.1291 138.7464 135.8242 0.0001 110.8227 0.0037 49.2265 5.8843 0.0001 0.0113 259.9186 0.0003 0.0000 39.2651 326.6032 0.0559 0.0030 697.6525 0.0026 202.1890 0.9640 16.1190 345.5731 2.6933 499.9339 0.0007 8.0001 30.8210 14.3954 40.1393 37.8221 316.5003 6.3649 143.6346 15.6895 123.2489 255.1348 0.7294 0.0140 0.0001 1.9349 1.1342 1.3701 0.0047 0.7999
temp: 298.150 k
press: 1.00000 atm
elementType: 35 35 35 35 35 35 8 8 8 8 6 6 6 6 6 6 6 6 6 6 6 6 6 6 6 6 1 1 1 1 1 1
symmnumber: 1
zpe: 458384.6 jmol-1
zpe.correction: 0.174589 hartree
zpe.thermalcorrener: 0.200854 hartree
zpe.thermalcorrenthalpy: 0.201798 hartree
zpe.thermalcorrgfe: 0.107476 hartree
zpe.sumelectzpe: -993.091309 hartree
zpe.sumelectthermal: -993.065044 hartree
zpe.sumelectthermalent: -993.064100 hartree
zpe.sumelectthermalfe: -993.158422 hartree
dipole: -0.0012 -0.0028 -0.0022
dipole: 0.0037
quadrupole: -185.3398 -192.8294 -214.8417
quadrupole: 0.0022 -3.8650 0.0012
quadrupole: 12.3305 4.8409 -17.1714 0.0022 -3.8650 0.0012
hfenergy: -993.265898 hartree
pointgroup: C01 [X(C16H6Br6O4)]
dipole: -0.0004535 -0.0011062 -0.0008527 debye
polarizability: 475.7753529|-0.0302196|306.9219179|35.9836848|-0.0289627|127.9519555 unknown
InChI: InChI=1S/C16H6Br6O4/c17-7-3-9(19)15(10(20)4-7)25-13(23)1-2-14(24)26-16-11(21)5-8(18)6-12(16)22/h1-6H
charge 0 multiplicity 1
32 atoms
Br -4.014904 -2.906649 0.457946
Br 4.013022 -2.905524 -0.456437
Br -4.016677 2.906701 0.453663
Br 4.01763 2.907729 -0.452362
Br -8.917824 -0.002288 -0.595442
Br 8.918878 -0.003562 0.590393
O  -2.893787 0.00045 0.777635
O  2.893449 0.002078 -0.775357
O  -2.17928 0.001711 -1.468776
O  2.178905 0.002304 1.470887
C  -4.255441 -0.000083 0.397175
C  4.254944 0.00088 -0.396261
C  -4.958823 -1.218606 0.248968
C  4.958166 -1.21786 -0.248593
C  -4.959565 1.21779 0.247151
C  4.960094 1.218294 -0.246856
C  -6.3374 -1.234212 -0.045553
C  6.337049 -1.234223 0.04416
C  -6.338158 1.232106 -0.047405
C  6.339011 1.232042 0.045921
C  -7.006199 -0.001367 -0.189649
C  7.006698 -0.001725 0.187345
C  -1.902792 0.000326 -0.256566
C  1.902454 0.002363 0.258633
C  -0.565309 0.001494 0.380139
C  0.56506 0.002252 -0.378132
H  -6.868803 -2.181325 -0.158378
H  6.868056 -2.181638 0.156289
H  -6.870144 2.178723 -0.161636
H  6.871526 2.178452 0.159389
H  -0.520187 0.001241 1.474267
H  0.519949 0.002328 -1.472258
