program: Gaussian 09
title: 000090348
version: EM64L-G09RevD.01
frameworkgroup: C1[X(C11H13N3O5)]
method: RPBEPBE
basis: SDD
operation: Freq
keyword: #p
keyword: freq=noraman
keyword: PBEPBE/SDD
title: #p freq=noraman PBEPBE/SDD
converged: YES YES NO NO
title: Mulliken charges:
elementType: O O O O O N N N C C C C C C C C C C C H H H H H H H H H H H H H
charge: -0.234621 -0.417182 -0.221695 -0.215420 -0.210323 -0.455403 -0.545490 0.021459 -0.272415 -0.388457 -0.483982 0.179403 0.508309 0.181129 -0.427281 -0.315847 0.392637 -0.343328 -0.362924 0.215343 0.239996 0.258245 0.272147 0.239503 0.308081 0.274844 0.293066 0.233315 0.318341 0.289070 0.288620 0.380860
chargesum: 0.00000
title: Mulliken charges with hydrogens summed into heavy atoms:
elementType: O O O O O N N N C C C C C C C C C C C
charge: -0.234621 -0.036321 -0.221695 -0.215420 -0.210323 -0.147322 0.022420 0.021459 -0.057072 0.109783 0.027668 0.179403 0.508309 0.181129 -0.193966 0.002494 0.392637 -0.054258 -0.074303
polarizability: 2.64623894e+02 -4.01608409e+01 1.20127992e+02 -2.79338342e+00 7.01173777e+00 1.44383781e+02
1716.lowfreq: -3.3061 -0.0005 0.0004 0.0005 4.3396 10.5794 14.4268 21.0737 28.7193
frequency: 14.2738 21.0669 28.6315 56.2516 63.3637 78.9762 89.5629 97.4500 123.2476 145.5437 181.1056 208.7507 217.9945 259.6730 300.9909 310.9092 331.6930 357.7567 360.3961 416.5313 422.6019 506.4300 507.9860 509.7848 515.6856 582.8527 619.5132 638.1971 640.5113 651.3860 667.1904 669.2715 673.2896 733.9684 743.7916 767.9184 802.2337 826.0596 838.3334 862.7127 883.0431 892.8607 980.2149 983.9607 999.3825 1013.6200 1030.4546 1044.4395 1082.7627 1095.4968 1113.4355 1117.6240 1133.8310 1150.9758 1178.7191 1204.4673 1224.1920 1249.7108 1264.3650 1276.2903 1294.3077 1311.0609 1324.3342 1350.6348 1359.7772 1378.2072 1389.1452 1425.6162 1439.8493 1462.3775 1484.4689 1503.8264 1596.5430 1611.5172 1624.8059 1646.6885 1672.4002 2967.7691 2987.4124 3017.2916 3036.4698 3088.6466 3125.9209 3178.4953 3185.9836 3200.8988 3440.7191 3513.8277 3515.0461 3567.3968
redmass: 8.4000 12.3564 6.3320 9.2810 5.2458 4.1779 3.2613 6.2597 3.5586 4.6859 5.1832 5.7714 4.5441 1.6508 3.4947 3.0057 5.0397 5.7093 5.0379 3.0443 6.3675 1.9265 6.5915 2.9010 3.5458 4.9435 5.3319 4.9383 1.3828 1.7254 2.7038 2.0865 1.5365 5.7942 5.4204 8.1759 1.7319 5.8481 1.3799 4.5431 1.5032 4.9013 1.3486 2.0651 3.0779 1.3180 1.9094 2.9236 2.4696 3.0992 2.3929 1.2990 2.6456 1.5419 1.4076 1.4175 4.6300 1.5343 2.1305 1.1931 1.3924 1.6015 1.4802 2.3210 2.0612 1.9188 4.8408 5.0740 1.0891 1.0902 2.4154 2.3402 7.8064 4.9683 5.1640 1.0912 8.2986 1.0846 1.0605 1.0620 1.0980 1.1024 1.0910 1.0906 1.0946 1.0962 1.0450 1.0760 1.0640 1.0974
irintensity: 0.0079 1.4845 1.5794 4.7280 0.6516 0.3220 2.9582 1.5544 2.1264 0.5771 0.8354 1.9766 1.8655 41.1949 27.5570 17.8691 5.9901 9.7166 14.6611 0.1826 2.2878 28.4505 1.6035 8.4998 51.0684 14.3734 11.1091 7.9092 119.4095 223.6876 12.6428 67.3106 103.3273 22.9035 20.3087 16.2579 45.8430 9.3582 29.8733 2.7899 69.2071 5.5033 2.1667 42.9119 0.5170 0.4699 50.3830 127.9885 61.1394 18.1683 22.7606 20.9968 189.3952 4.2727 171.8113 16.8864 432.9211 2.5783 52.0393 3.9623 45.5305 21.1360 30.7037 39.1479 64.3419 49.8117 215.2030 31.7715 25.0835 28.1136 5.9298 401.1516 82.8084 147.2938 82.6046 45.3476 214.7153 35.1716 9.1403 12.6636 4.5387 15.2549 11.9791 2.4448 2.8881 4.7751 8.8247 16.7725 24.6773 3.7982
temp: 298.150 k
press: 1.00000 atm
elementType: 8 8 8 8 8 7 7 7 6 6 6 6 6 6 6 6 6 6 6 1 1 1 1 1 1 1 1 1 1 1 1 1
symmnumber: 1
zpe: 630821.8 jmol-1
zpe.correction: 0.240267 hartree
zpe.thermalcorrener: 0.258872 hartree
zpe.thermalcorrenthalpy: 0.259817 hartree
zpe.thermalcorrgfe: 0.189643 hartree
zpe.sumelectzpe: -965.876117 hartree
zpe.sumelectthermal: -965.857512 hartree
zpe.sumelectthermalent: -965.856568 hartree
zpe.sumelectthermalfe: -965.926742 hartree
dipole: 4.0183 -1.0698 4.2993
dipole: 5.9812
quadrupole: -165.4821 -103.6535 -106.3433
quadrupole: 13.6109 1.6710 -2.1665
quadrupole: -40.3225 21.5061 18.8164 13.6109 1.6710 -2.1665
hfenergy: -966.1163848 hartree
pointgroup: C01 [X(C11H13N3O5)]
dipole: -1.5465627 0.4886704 1.7049398 debye
polarizability: 263.8958229|-41.6252633|120.5505928|1.8857833|-5.5708881|144.6892517 unknown
InChI: InChI=1S/C11H13N3O5/c12-9(5-6-10(15)16)11(17)13-7-1-3-8(4-2-7)14(18)19/h1-4,9,13,15H,5-6,12H2
charge 0 multiplicity 1
32 atoms
O  -1.20321 1.310333 -1.397691
O  -4.440674 -2.9995 0.410159
O  -5.745109 -1.334788 -0.551133
O  5.806328 -1.023864 0.752258
O  5.503432 -0.738847 -1.492658
N  -0.305094 0.870321 0.732599
N  -3.040781 3.04111 0.239543
N  5.079576 -0.711987 -0.271773
C  -2.668095 1.65068 0.552706
C  -3.801438 0.705369 0.089893
C  -3.542694 -0.770327 0.442798
C  -1.334277 1.253368 -0.140084
C  1.024235 0.483836 0.429131
C  -4.69492 -1.670255 0.035541
C  1.869746 0.129149 1.520142
C  1.52986 0.439947 -0.901876
C  3.682055 -0.300497 -0.029623
C  3.197262 -0.262864 1.297713
C  2.860576 0.046399 -1.124856
H  -2.560097 1.568843 1.654958
H  -3.922907 0.806923 -1.004886
H  -4.73954 1.055548 0.553584
H  -2.631237 -1.156628 -0.053894
H  -3.380935 -0.909132 1.530295
H  -0.547066 0.868492 1.727408
H  -2.404208 3.748994 0.622124
H  -3.204061 3.18361 -0.764477
H  1.481722 0.161361 2.545678
H  0.876187 0.712515 -1.731599
H  3.861394 -0.538065 2.120733
H  3.273376 0.003715 -2.136195
H  -5.203707 -3.572757 0.125883
