program: Gaussian 09
title: 000090323
version: EM64L-G09RevD.01
frameworkgroup: C1[X(C14H14O3)]
method: RPBEPBE
basis: SDD
operation: Freq
keyword: #pfreq=noraman
keyword: PBEPBE/SDD
title: #p freq=noraman PBEPBE/SDD
converged: YES YES NO NO
title: Mulliken charges:
elementType: O O O C C C C C C C C C C C C C C H H H H H H H H H H H H H H
charge: -0.263460 -0.420524 -0.227157 0.336416 -0.303258 0.171220 0.450365 -0.369481 -0.355533 -0.738190 -0.467242 -0.595196 -0.267943 0.328239 0.198145 -0.402908 -0.536606 0.249800 0.232471 0.254314 0.232503 0.238000 0.225865 0.236875 0.249988 0.225859 0.251584 0.375751 0.245658 0.222191 0.222253
chargesum: 0.00000
title: Mulliken charges with hydrogens summed into heavy atoms:
elementType: O O O C C C C C C C C C C C C C C
charge: -0.263460 -0.044773 -0.227157 0.336416 -0.053458 0.171220 0.450365 -0.137010 -0.101219 -0.041822 -0.230367 -0.345208 -0.042084 0.328239 0.198145 -0.151324 0.153496
polarizability: 2.32782755e+02 -2.04933801e+01 1.75060570e+02 -3.89036005e+00 -1.15799667e+01 9.38058353e+01
1716.lowfreq: -10.5329 -0.0008 -0.0005 -0.0004 1.8942 9.4553 23.9661 50.0616 64.6813
frequency: 23.8051 49.9767 64.6777 92.5116 135.0847 142.2220 159.6678 204.6667 220.6352 230.3664 247.9074 274.4286 289.8585 320.7994 385.8754 409.8872 425.2878 429.8700 506.0893 507.3605 516.5381 551.3962 595.5306 603.8402 634.1726 652.2776 679.7158 695.4421 752.5948 764.9148 780.0650 802.1720 827.8307 835.9852 869.2878 912.6522 917.1030 962.6932 976.7118 981.9233 1000.0452 1020.4510 1030.3960 1059.4778 1095.3219 1113.6460 1115.5863 1150.4140 1161.0725 1173.8231 1193.2128 1228.8682 1242.6640 1253.8891 1271.1763 1304.3544 1338.6961 1357.8013 1390.9873 1402.1918 1414.2069 1432.2032 1446.9040 1465.7260 1466.3331 1470.2786 1473.9667 1488.6287 1519.9422 1589.5613 1604.5526 1632.9763 1663.8806 2959.4937 2997.4356 3046.8739 3050.4103 3091.6117 3109.5250 3120.9881 3126.4836 3144.9939 3147.5980 3154.9073 3168.2691 3176.7199 3506.1746
redmass: 6.5277 4.3468 6.5996 4.4334 4.0674 4.0367 3.9791 3.2069 1.5785 1.1725 2.1716 2.9356 3.0363 4.3523 4.8648 4.3644 3.8768 4.5031 3.8141 4.2114 3.5565 3.9051 4.0745 2.3191 2.2361 2.4879 4.5745 4.7941 4.2612 1.6505 2.6311 1.6032 3.2141 2.2809 1.9152 4.1200 1.5583 1.3579 3.0614 1.5308 4.5849 1.7306 3.1437 1.6521 1.9584 1.2664 2.4552 1.3992 1.3663 1.4814 1.4524 1.5103 2.1107 2.7018 1.6988 1.5882 1.6198 2.0564 1.2192 2.8508 5.8160 1.2286 3.0213 1.0553 1.8986 1.1607 1.1005 1.0640 3.8732 7.7454 5.4871 6.4338 8.2225 1.0330 1.0356 1.1038 1.0844 1.0993 1.1006 1.0871 1.0994 1.0930 1.0908 1.0873 1.0958 1.0968 1.0639
irintensity: 1.1625 2.1279 1.2445 1.3884 1.5437 0.8874 3.0418 2.5674 0.9356 0.2058 4.9386 0.3204 0.2092 3.1635 8.1815 8.4137 6.2674 4.4612 12.2790 5.6636 0.5011 16.0674 3.7168 69.4343 66.2056 13.1290 18.1775 17.8025 11.2930 15.4854 0.9438 27.5727 24.5695 24.3619 42.8273 5.8613 5.5389 0.8151 15.4590 3.9933 47.5006 17.2737 223.1585 10.1741 12.4619 0.1324 18.1928 23.6202 19.1245 35.8260 63.9397 0.5416 15.9310 82.1872 13.9140 27.2061 21.9119 12.9848 21.1135 9.0484 2.1306 19.9804 63.2062 13.3874 56.9546 10.6820 19.4552 10.7291 26.0735 4.6890 40.9979 94.0978 217.0458 62.7480 25.4289 48.1262 3.8377 31.0896 15.4561 3.4847 28.2935 14.9764 22.7520 1.3903 18.1246 6.7359 18.8347
temp: 298.150 k
press: 1.00000 atm
elementType: 8 8 8 6 6 6 6 6 6 6 6 6 6 6 6 6 6 1 1 1 1 1 1 1 1 1 1 1 1 1 1
symmnumber: 1
zpe: 644838.3 jmol-1
zpe.correction: 0.245606 hartree
zpe.thermalcorrener: 0.261113 hartree
zpe.thermalcorrenthalpy: 0.262057 hartree
zpe.thermalcorrgfe: 0.202187 hartree
zpe.sumelectzpe: -766.343178 hartree
zpe.sumelectthermal: -766.327671 hartree
zpe.sumelectthermalent: -766.326727 hartree
zpe.sumelectthermalfe: -766.386597 hartree
dipole: 2.1402 0.4593 0.3980
dipole: 2.2249
quadrupole: -89.3918 -90.8009 -101.9488
quadrupole: 8.3560 -8.6341 1.0251
quadrupole: 4.6554 3.2463 -7.9017 8.3560 -8.6341 1.0251
hfenergy: -766.5887841 hartree
pointgroup: C01 [X(C14H14O3)]
dipole: -0.8502962 -0.1436883 0.1501478 debye
polarizability: 230.7391978|-23.1577118|176.801364|4.9638172|12.1326255|94.1085993 unknown
InChI: InChI=1S/C14H14O3/c1-9(14(15)16)12-5-3-4-10-8-11(17-2)6-7-13(10)12/h3-9,15H,1-2H3
charge 0 multiplicity 1
31 atoms
O  -4.008695 1.353248 0.117092
O  2.537199 2.262067 -0.67477
O  3.891132 0.491362 -1.32173
C  1.345317 -0.629377 0.326022
C  2.514015 0.288399 0.741095
C  -0.009214 -0.124816 0.26245
C  -1.084297 -1.029924 -0.103047
C  1.595461 -1.968529 -0.005457
C  -0.35965 1.244262 0.538686
C  3.664771 -0.442274 1.472496
C  -0.778745 -2.394148 -0.41791
C  -2.439006 -0.5583 -0.155688
C  0.53847 -2.850869 -0.377505
C  -2.730214 0.777256 0.136519
C  3.071261 0.972862 -0.511913
C  -1.677303 1.684624 0.482428
C  -5.130863 0.484422 -0.244546
H  2.127073 1.082441 1.400499
H  2.618939 -2.353213 0.02083
H  0.423035 1.971995 0.767367
H  3.267936 -1.02635 2.320313
H  4.207876 -1.118605 0.792164
H  4.394686 0.28948 1.86234
H  -1.594969 -3.071568 -0.696162
H  -3.224819 -1.268707 -0.431818
H  0.770202 -3.891718 -0.628189
H  -1.941639 2.726099 0.688989
H  2.880607 2.656087 -1.522851
H  -6.020968 1.128925 -0.202705
H  -5.239041 -0.351126 0.474408
H  -5.009357 0.078796 -1.268007
