program: Gaussian 09
title: 000090295
version: EM64L-G09RevD.01
frameworkgroup: C1[X(C10H9NO)]
method: RPBEPBE
basis: SDD
operation: Freq
keyword: #p
keyword: freq=noraman
keyword: PBEPBE/SDD
title: #p freq=noraman PBEPBE/SDD
converged: NO YES NO YES
title: Mulliken charges:
elementType: O N C C C C C C C C C C H H H H H H H H H
charge: -0.447429 -0.703140 0.172845 0.497025 -0.642460 0.171269 -0.356593 -0.482982 0.528880 -0.431517 -0.438437 -0.210816 0.225621 0.266482 0.233342 0.216452 0.214202 0.219716 0.305398 0.304835 0.357305
chargesum: 0.00000
title: Mulliken charges with hydrogens summed into heavy atoms:
elementType: O N C C C C C C C C C C
charge: -0.090124 -0.092907 0.172845 0.497025 -0.416838 0.171269 -0.090111 -0.249639 0.528880 -0.215065 -0.224235 0.008900
polarizability: 1.95538058e+02 8.56932622e+00 1.30011186e+02 -5.41357752e-03 -1.12453697e-03 4.76230453e+01
1716.lowfreq: -15.1000 -0.0012 -0.0011 -0.0006 5.1393 8.4995 109.1598 147.0028 231.4310
frequency: 109.1592 147.0023 231.4309 251.4451 290.7574 341.1490 346.7080 367.3868 389.9442 426.7261 449.1701 464.9798 499.9717 519.9657 566.8976 601.6076 649.7195 703.4102 714.9695 748.5981 788.1631 826.0739 833.1149 834.6535 887.5724 937.0347 957.7972 972.3165 1012.7632 1049.5717 1072.5534 1146.6511 1167.4797 1195.2584 1210.9127 1246.5285 1271.6322 1321.9699 1383.9169 1415.8993 1425.3782 1462.1256 1478.2033 1530.1157 1583.6852 1612.8939 1641.2177 1650.1998 3113.3700 3114.0932 3120.3519 3127.7506 3153.5063 3167.6602 3567.6247 3583.7977 3708.3608
redmass: 4.5207 4.3762 4.7153 3.8036 3.7312 3.8890 1.1777 1.1341 1.1086 2.9243 4.5366 5.0208 5.4249 3.0623 6.8484 4.4928 2.3732 5.0342 6.4822 1.4777 1.9632 1.7846 5.3987 1.4569 1.9106 2.8908 1.3352 1.3406 3.1274 1.5516 2.1015 1.2507 1.1400 1.5115 1.4702 1.8581 1.8759 2.7377 2.0645 4.1207 5.8136 3.3450 3.2411 4.2042 7.7809 4.9233 1.2964 5.0081 1.0884 1.0899 1.0894 1.0895 1.0992 1.0949 1.0449 1.0659 1.1040
irintensity: 5.1416 5.2212 8.7100 6.3081 0.0264 1.4131 218.0394 150.5473 88.3182 0.0001 0.3644 3.5719 5.8086 1.5250 0.3052 0.2792 0.0314 6.0075 2.0737 63.1133 21.0806 42.3232 23.6335 15.2385 49.0964 4.4984 3.6539 1.0530 78.6756 32.6833 17.0633 57.7217 11.2704 11.9954 91.6367 28.7303 27.5400 61.7110 18.5695 17.6452 23.2241 20.0942 76.9603 24.6638 58.5173 15.6222 64.3432 385.4279 27.8234 2.1088 21.0167 19.6708 33.4445 7.1082 85.0136 33.2528 20.2431
temp: 298.150 k
press: 1.00000 atm
elementType: 8 7 6 6 6 6 6 6 6 6 6 6 1 1 1 1 1 1 1 1 1
symmnumber: 1
zpe: 433007.5 jmol-1
zpe.correction: 0.164924 hartree
zpe.thermalcorrener: 0.174700 hartree
zpe.thermalcorrenthalpy: 0.175644 hartree
zpe.thermalcorrgfe: 0.130559 hartree
zpe.sumelectzpe: -515.613907 hartree
zpe.sumelectthermal: -515.604131 hartree
zpe.sumelectthermalent: -515.603187 hartree
zpe.sumelectthermalfe: -515.648272 hartree
dipole: -1.2706 0.3540 0.0017
dipole: 1.3190
quadrupole: -41.4036 -63.6436 -77.1168
quadrupole: -2.8580 -0.0093 0.0002
quadrupole: 19.3177 -2.9223 -16.3954 -2.8580 -0.0093 0.0002
hfenergy: -515.7788307 hartree
pointgroup: C01 [X(C10H9N1O1)]
dipole: -0.4950656 -0.1555877 -0.0006681 debye
dipolederiv: -0.3394448 -0.3909686 -0.0000033 -0.6502056 -1.2014821 -0.0000198 -0.0000146 -0.0000354 -0.4118031 -1.7419006 -0.0611424 0.0002596 -0.3094243 -0.1065408 -0.0000192 0.0009609 -0.0000302 -0.7527276 -0.4147032 -0.1342532 0.0000051 -0.0714868 -0.2721452 -0.0000047 -0.0000053 0. -0.0392831 0.6441991 0.0296982 0.0000021 -0.0498865 0.0310295 -0.0000092 0.0000237 -0.0000155 0.0955807 -0.720026 -0.0284534 0.0000084 0.4180495 0.048522 0.0000041 -0.000077 -0.0000226 -0.2916349 0.6581409 0.2118607 0.0000212 0.5992495 1.1385852 0.0000261 0.0000329 0.0000331 0.0656209 0.2904476 -0.0901906 0.0000019 -0.0879869 0.0829762 -0.0000038 0.0000179 0.0000016 -0.1125949 -0.3554119 -0.0283652 -0.0000038 0.0924543 0.0323845 -0.0000017 -0.0000124 -0.0000068 -0.2454968 1.8545745 0.1195628 -0.0001237 0.2051863 0.0692452 0.0000022 -0.0001389 0.0000489 0.1568708 -0.3532721 -0.0160941 -0.0000112 -0.3766717 0.0633508 -0.0000112 -0.000022 0.0000017 -0.2318691 -0.1600003 0.2501761 0.000015 -0.1348866 -0.4768044 -0.000011 0.0000104 0.0000072 -0.2573242 0.1826051 0.0618054 0.000015 0.1557655 0.2694269 0.0000059 0.0000197 -0.0000037 -0.135149 0.0164491 -0.0486044 -0.0000054 -0.0976862 -0.1020526 -0.0000095 -0.0000035 0.0000062 0.1732273 0.1010835 -0.0509684 -0.0000024 -0.0101462 -0.0344923 0.0000005 -0.0000087 0.0000007 0.1551764 0.0469541 -0.093755 -0.0000042 -0.0218294 -0.1018071 0.0000027 -0.000005 0.0000003 0.1690865 -0.0676008 0.1243713 -0.0000082 0.1015007 -0.0270644 0.0000097 -0.0000008 0.000001 0.1641167 -0.1396181 -0.0634243 -0.000018 -0.0929687 0.0477975 -0.0000024 -0.0000216 -0.0000028 0.1849585 -0.0263692 0.122596 -0.0000119 0.1211423 -0.0402208 0.0000084 -0.0000094 0.0000122 0.1570362 0.2309359 -0.0011518 -0.000074 -0.0191095 0.1222066 0.0000803 -0.0004208 0.0001249 0.3884993 0.2019273 0.0256395 -0.0000537 0.0598839 0.1043168 -0.0000505 -0.0003196 -0.0001249 0.3869746 0.0910298 0.0616615 -0.0000087 0.1690564 0.3527684 0.0000032 -0.0000059 0.0000043 0.3807345 unknown
polarizability: 196.0293646|-6.4029807|129.5198794|0.0054475|-0.0009464|47.6230453 unknown
InChI: InChI=1S/C10H9NO/c11-8-4-5-9-7(6-8)2-1-3-10(9)12/h1-6,12H,11H2
charge 0 multiplicity 1
21 atoms
O  2.184836 2.11217 0.000081
N  -3.787178 -0.334694 -0.000018
C  0.390144 0.501126 -0.000005
C  -0.068293 -0.874066 -0.000003
C  -1.472717 -1.136324 -0.000074
C  1.802287 0.756285 0.000046
C  -0.578789 1.554837 -0.000049
C  0.903806 -1.933258 0.000041
C  -2.413146 -0.087815 -0.000112
C  -1.941909 1.274667 -0.000092
C  2.733718 -0.289233 0.000109
C  2.268647 -1.640194 0.000103
H  -1.815275 -2.179269 -0.000071
H  -0.224031 2.589619 -0.000046
H  0.560216 -2.973953 0.000041
H  -2.672532 2.093286 -0.000097
H  3.810932 -0.078206 0.000173
H  3.003616 -2.452998 0.000157
H  -4.452883 0.431932 -0.000589
H  -4.146254 -1.284633 -0.000405
H  3.170605 2.193922 0.00011
