program: Gaussian 09
title: 000090330
version: EM64L-G09RevD.01
frameworkgroup: C1[X(C18H16N2O6)]
method: RPBEPBE
basis: SDD
operation: Freq
keyword: #p
keyword: freq=noraman
keyword: PBEPBE/SDD
title: #p freq=noraman PBEPBE/SDD
converged: YES YES NO NO
title: Mulliken charges:
elementType: O O O O O O N N C C C C C C C C C C C C C C C C C C H H H H H H H H H H H H H H H H
charge: -0.314551 -0.314399 -0.285136 -0.285131 -0.247632 -0.247641 -0.342427 -0.342246 0.297472 0.297698 0.252560 0.252542 -0.330517 -0.331025 -0.341819 -0.341956 -0.366268 -0.366088 -0.331171 -0.331132 0.197842 0.197456 0.178349 0.178351 -0.499391 -0.499390 0.216748 0.217083 0.280590 0.280509 0.275739 0.275741 0.277007 0.277009 0.358303 0.358337 0.234753 0.244708 0.244828 0.244708 0.244834 0.234751
chargesum: 0.00000
title: Mulliken charges with hydrogens summed into heavy atoms:
elementType: O O O O O O N N C C C C C C C C C C C C C C C C C C
charge: -0.314551 -0.314399 -0.285136 -0.285131 -0.247632 -0.247641 0.015876 0.016091 0.297472 0.297698 0.252560 0.252542 -0.113769 -0.113942 -0.061229 -0.061446 -0.090529 -0.090347 -0.054164 -0.054122 0.197842 0.197456 0.178349 0.178351 0.224897 0.224904
polarizability: 5.14956946e+02 -6.81657304e+00 2.26158286e+02 -1.23393863e-01 1.17535909e-01 9.87565037e+01
1716.lowfreq: -2.7042 -0.0009 0.0007 0.0014 1.8312 4.9550 6.9020 10.8029 16.0014
frequency: 4.6580 10.7620 15.9735 25.4938 53.9702 58.7343 65.0124 76.6083 82.3304 98.8965 101.3863 109.5616 123.7609 127.2359 141.3325 157.6018 208.0392 218.2646 240.7846 271.1963 272.7828 294.9260 303.6072 307.2570 322.8616 372.5124 401.5829 402.4124 452.6220 466.0757 475.6954 478.2179 485.4718 488.3180 531.6707 596.5023 617.6122 629.2000 629.3703 659.8773 677.5022 681.1203 689.3522 692.0665 697.4359 762.0221 774.4412 775.3023 775.4211 811.3380 848.4153 849.9310 888.3944 888.8699 920.3520 921.0280 921.2238 989.8176 989.9038 1010.5329 1010.8785 1014.0290 1014.0946 1041.6345 1073.4909 1075.0460 1094.4296 1114.8859 1114.8865 1121.8155 1121.9492 1149.9893 1150.1866 1189.3134 1191.5071 1213.9458 1235.7881 1255.6616 1259.0710 1282.3680 1311.4442 1317.3714 1378.1161 1381.3491 1407.0688 1410.8570 1417.7738 1424.4914 1425.7402 1452.3080 1452.3760 1463.1550 1463.2013 1494.8817 1503.0876 1519.8560 1531.6445 1554.0358 1580.2753 1593.5437 1620.3968 1620.5626 1624.7367 1626.4320 3006.0197 3006.0538 3108.1838 3108.2069 3134.1934 3134.2643 3151.6836 3151.7571 3161.2117 3161.2319 3166.5805 3166.5979 3184.0954 3184.1296 3490.5584 3505.0989
redmass: 4.4067 6.1473 7.0173 6.7472 4.5115 4.4505 4.5260 4.6467 4.1057 1.1935 1.3642 6.6974 5.7537 5.1279 3.8151 4.3197 5.3709 5.5620 5.8314 9.4284 6.6917 5.0331 11.3225 4.5998 6.1000 5.9927 2.7600 2.8155 6.5363 3.9889 4.2688 6.4329 7.2005 6.2235 5.1481 1.4441 1.1233 6.8097 7.0481 5.7478 3.7509 6.7249 6.5761 3.4442 2.9457 6.3513 4.7352 4.7348 5.9903 7.5452 1.4213 1.4252 1.5191 1.5347 6.4943 8.2423 7.1580 1.3852 1.3852 3.2904 3.3100 1.3740 1.3688 3.5595 5.0984 4.3797 2.3373 1.2642 1.2642 1.3792 1.4622 1.4824 1.4845 1.2055 1.1613 3.4882 1.7508 3.1398 4.0419 2.3265 1.2900 1.4478 5.0432 5.6243 4.0277 3.9554 2.7000 1.1882 1.3166 1.0495 1.0495 1.0515 1.0515 2.4345 2.7175 9.8959 2.4602 7.1340 7.9058 6.8329 6.6848 6.5728 9.1201 8.7901 1.0296 1.0296 1.1046 1.1046 1.0890 1.0890 1.1049 1.1049 1.0895 1.0895 1.0954 1.0954 1.0963 1.0963 1.0788 1.0793
irintensity: 1.4425 0.0355 0.0012 0.2436 0.0075 2.6677 0.0267 0.0054 0.0266 0.0250 0.1336 8.8530 0.0576 8.2957 0.2660 20.2961 0.1250 2.0991 73.0530 0.4430 1.3200 0.2850 0.0071 12.0160 0.0684 0.0326 0.3352 0.0015 26.0762 0.1071 4.7486 0.0515 25.1002 0.2423 8.3472 0.0963 165.1199 1.1002 0.0603 0.0258 0.1627 4.0098 1.7099 175.5716 0.7235 15.4554 0.4251 0.0811 0.1882 11.4269 38.0876 0.7635 65.5969 0.6566 0.1119 9.2858 0.0152 1.0113 0.3953 106.5301 0.0840 0.4976 0.3828 0.0175 466.1512 0.8777 42.6636 0.0376 0.0495 0.1360 17.2813 146.4454 2.0142 0.1017 28.7346 0.0789 74.3359 899.9175 0.9759 0.0090 13.7548 0.0125 20.6234 0.0037 284.4657 0.2664 774.8384 0.0466 30.6907 14.3918 15.3549 15.2475 8.8084 0.0406 245.3344 223.6698 0.0252 0.0282 126.9809 0.1205 0.3293 42.1025 348.2822 1.1026 87.2759 0.1120 20.6267 29.5098 27.0914 0.1321 15.9151 14.9374 0.0705 0.0523 3.6359 3.5949 1.2978 0.5665 0.0493 169.2130
temp: 298.150 k
press: 1.00000 atm
elementType: 8 8 8 8 8 8 7 7 6 6 6 6 6 6 6 6 6 6 6 6 6 6 6 6 6 6 1 1 1 1 1 1 1 1 1 1 1 1 1 1 1 1
symmnumber: 1
zpe: 819825.9 jmol-1
zpe.correction: 0.312255 hartree
zpe.thermalcorrener: 0.337177 hartree
zpe.thermalcorrenthalpy: 0.338121 hartree
zpe.thermalcorrgfe: 0.251063 hartree
zpe.sumelectzpe: -1254.523403 hartree
zpe.sumelectthermal: -1254.498481 hartree
zpe.sumelectthermalent: -1254.497537 hartree
zpe.sumelectthermalfe: -1254.584595 hartree
dipole: -0.0004 -0.0014 0.3047
dipole: 0.3047
quadrupole: -100.4728 -159.8985 -152.7587
quadrupole: -24.0604 -0.1677 0.1015
quadrupole: 37.2372 -22.1885 -15.0487 -24.0604 -0.1677 0.1015
hfenergy: -1254.8356578 hartree
pointgroup: C01 [X(C18H16N2O6)]
dipole: 0.0001586 -0.000724 -0.1198748 debye
polarizability: 514.9542682|6.8736093|226.160444|-0.0666531|-0.2888377|98.7570234 unknown
InChI: InChI=1S/C18H16N2O6/c1-25-17(23)13-7-3-11(4-8-13)15(21)19-20-16(22)12-5-9-14(10-6-12)18(24)26-2/h3-10,19-20H,1-2H3
charge 0 multiplicity 1
42 atoms
O  -1.20823 -2.048537 -0.050461
O  1.210199 2.050097 -0.033515
O  -8.097453 -0.629613 -0.169734
O  8.098733 0.626711 -0.177311
O  -7.734385 1.665034 0.012735
O  7.734864 -1.666126 0.025189
N  -0.672437 0.181308 -0.016665
N  0.674139 -0.179974 -0.017282
C  -3.053592 -0.439756 -0.03532
C  3.055153 0.440739 -0.027353
C  -5.829755 0.1371 -0.056133
C  5.830914 -0.137708 -0.050986
C  -3.506442 0.904671 0.056404
C  3.507573 -0.903061 0.075126
C  -4.004416 -1.488608 -0.132671
C  4.006221 1.488307 -0.135766
C  -4.883423 1.189449 0.045547
C  4.884382 -1.188638 0.06275
C  -5.382209 -1.206104 -0.143993
C  5.383832 1.204983 -0.148693
C  -1.610716 -0.833715 -0.033507
C  1.612479 0.835164 -0.024754
C  -7.278591 0.497386 -0.064532
C  7.279523 -0.498889 -0.060562
C  -9.554231 -0.357797 -0.186108
C  9.555311 0.353886 -0.195502
H  -2.804554 1.741544 0.145056
H  2.805375 -1.738359 0.175533
H  -3.631836 -2.515507 -0.197716
H  3.63402 2.514891 -0.207648
H  -5.249362 2.218616 0.116165
H  5.250087 -2.217272 0.141794
H  -6.118185 -2.010544 -0.220119
H  6.120002 2.008374 -0.233545
H  -0.811149 1.197337 -0.02561
H  0.812888 -1.195881 -0.037069
H  -10.023316 -1.34772 -0.271214
H  -9.812396 0.281916 -1.046629
H  -9.857556 0.149256 0.745145
H  9.810668 -0.293204 -1.051333
H  9.86095 -0.14553 0.739114
H  10.024721 1.342776 -0.290226
