program: Gaussian 09
title: 000007894
version: EM64L-G09RevD.01
frameworkgroup: C1[X(C5H13N)]
method: RPBEPBE
basis: SDD
operation: Freq
keyword: #pfreq=noraman
keyword: PBEPBE/SDD
title: #p freq=noraman PBEPBE/SDD
converged: YES YES NO NO
title: Mulliken charges:
elementType: N C C C C C H H H H H H H H H H H H H
charge: -0.573559 -0.023037 -0.344474 -0.397000 -0.709703 -0.705225 0.186364 0.177094 0.211448 0.216126 0.173562 0.217574 0.207113 0.209457 0.210152 0.207278 0.210661 0.256320 0.269850
chargesum: 0.00000
title: Mulliken charges with hydrogens summed into heavy atoms:
elementType: N C C C C C
charge: -0.047388 0.163327 0.044067 -0.007312 -0.075559 -0.077135
polarizability: 7.18736006e+01 3.06195517e-01 6.12076948e+01 -7.46466225e-01 2.05043468e-01 5.25966918e+01
1716.lowfreq: -10.5014 -0.0006 -0.0003 0.0002 5.8103 25.9454 85.9072 110.3132 178.5350
frequency: 85.6651 110.0121 178.5165 210.1271 237.3373 246.3272 322.8306 373.5277 429.5753 454.6222 596.8283 783.3261 819.3602 911.5596 928.1425 942.0558 962.1060 1008.2113 1071.8939 1115.1034 1141.7300 1176.2093 1188.9224 1238.8893 1285.9351 1295.7125 1330.6987 1337.0426 1373.3303 1385.2256 1392.8377 1456.0949 1468.1790 1472.7950 1481.6876 1487.9434 1492.9452 1638.4945 2852.8015 2951.1684 2953.0461 2965.8882 2970.3032 3012.1060 3035.3273 3058.1181 3064.4869 3067.8742 3073.0189 3451.1222 3579.3488
redmass: 1.7841 2.4049 2.4599 1.0543 1.1533 1.1258 2.3203 2.2838 2.4147 2.3065 1.2761 1.2380 2.2042 1.2230 1.8144 1.2819 1.4672 2.0560 1.8974 2.3987 1.9455 1.7300 1.7481 1.3908 1.1028 1.2811 1.4752 1.4784 1.2364 1.3809 1.2503 1.0746 1.0471 1.0579 1.0567 1.0483 1.0848 1.0946 1.0719 1.0805 1.0653 1.0354 1.0363 1.0873 1.0981 1.0995 1.0993 1.0991 1.0983 1.0447 1.0975
irintensity: 4.2484 0.5206 0.6493 2.7077 7.2884 39.8296 8.7172 3.3930 0.5529 9.0206 232.7012 2.5062 1.0252 3.5771 1.6567 5.4821 1.4992 5.7442 2.4236 17.7500 4.3035 5.4615 2.9253 2.9483 3.5452 3.9954 3.3667 2.3443 20.5237 16.1730 7.9004 0.8966 0.8803 7.6858 8.2983 23.9873 1.5731 39.9088 115.9424 34.4869 30.9184 44.5010 20.9630 15.3248 62.5134 8.7427 70.4607 82.5531 56.5218 2.0812 0.0856
temp: 298.150 k
press: 1.00000 atm
elementType: 7 6 6 6 6 6 1 1 1 1 1 1 1 1 1 1 1 1 1
symmnumber: 1
zpe: 457370.7 jmol-1
zpe.correction: 0.174203 hartree
zpe.thermalcorrener: 0.182688 hartree
zpe.thermalcorrenthalpy: 0.183632 hartree
zpe.thermalcorrgfe: 0.141971 hartree
zpe.sumelectzpe: -252.542858 hartree
zpe.sumelectthermal: -252.534374 hartree
zpe.sumelectthermalent: -252.533430 hartree
zpe.sumelectthermalfe: -252.575090 hartree
dipole: 0.3127 0.0282 1.2928
dipole: 1.3304
quadrupole: -37.4282 -39.0461 -41.9911
quadrupole: 0.0446 3.5953 -0.8955
quadrupole: 2.0603 0.4423 -2.5026 0.0446 3.5953 -0.8955
hfenergy: -252.7170614 hartree
pointgroup: C01 [X(C5H13N1)]
dipole: -0.1050331 -0.0119381 0.5126318 debye
dipolederiv: -0.6374392 0.1212911 -0.1013237 0.1220675 -0.2397057 0.0962228 -0.1429772 0.1022754 -0.7078938 0.1107544 -0.0007938 0.005172 -0.0289987 0.1312702 0.0069764 0.0263315 0.0052491 0.173282 -0.0776926 -0.0095368 0.0062018 -0.057147 0.0796734 0.0454235 0.0147362 0.066785 0.1094575 0.5019886 -0.1620012 0.1513423 -0.1373411 0.2144507 -0.0395746 0.0306791 -0.0210556 0.4249475 0.0193641 0.015413 0.0072446 0.0279981 -0.0920999 -0.0495966 -0.0084196 -0.0273541 0.0806386 -0.0394629 -0.0618781 0.0320757 -0.0448522 -0.0079889 0.0208053 0.0029615 0.0038308 0.0952232 0.0335547 -0.0067959 0.0358306 0.0100633 0.0152408 0.0101074 0.0057496 0.0094343 -0.2230652 0.025541 0.0467709 0.0004913 0.0482802 -0.2022351 -0.0684868 0.0253045 -0.0911848 0.0389354 0.0468488 -0.0036806 0.0234273 -0.0148384 0.0678602 0.010338 0.0106633 0.0332163 -0.1686026 0.050597 0.01296 -0.0152246 0.0294205 -0.1645157 -0.0611192 -0.0145309 -0.0887876 0.0232884 -0.0710881 0.0446975 -0.0866859 0.0333099 0.0170478 0.0520665 -0.0903439 0.1047487 -0.2995321 -0.0199923 -0.1580169 0.0603058 -0.1340419 -0.0622703 0.0346094 0.057152 0.0461602 0.055808 0.0956272 0.0027997 -0.0176147 0.0013145 0.0649074 0.0394778 0.0082279 -0.0327392 -0.1752865 -0.1652025 0.1236417 -0.0624097 0.0749666 0.0486097 0.0061583 -0.073864 0.0206095 0.0643704 -0.1864369 0.0365642 -0.0648216 0.0865752 0.0596376 0.0414872 -0.0833853 0.0296839 0.0594789 0.0789906 -0.0118049 -0.0211307 -0.0170688 0.0787122 -0.0095098 0.0447862 0.0431584 -0.1782831 0.0793749 0.0544474 0.0344876 0.0043269 -0.1724169 -0.0812062 0.018678 -0.0937835 0.052006 0.1594275 0.0042116 -0.0273033 0.0504888 0.0447175 -0.0984542 0.0095443 -0.1742983 0.2542866 -0.0047544 -0.0482891 0.0399351 -0.0545232 0.119105 0.0442749 0.1587067 0.0640514 0.3209405 unknown
polarizability: 71.9105234|-0.0356359|61.2024088|0.0481977|-0.1482665|52.5650551 unknown
InChI: InChI=1S/C5H13N/c1-5(2)3-4-6/h5H,3-4,6H2,1-2H3
charge 0 multiplicity 1
19 atoms
N  -2.790154 0.3140 -0.083009
C  1.06094 -0.02672 0.320091
C  -0.318009 0.497208 -0.160152
C  -1.525589 -0.326679 0.333914
C  1.367272 -1.444054 -0.223501
C  2.182107 0.960531 -0.083965
H  1.036606 -0.082684 1.430408
H  -0.43997 1.544471 0.19255
H  -0.34471 0.533288 -1.267364
H  -1.496451 -1.33571 -0.11835
H  -1.429852 -0.466531 1.440987
H  0.631481 -2.190332 0.127145
H  1.35143 -1.445764 -1.330878
H  2.368835 -1.784018 0.100604
H  3.16801 0.621119 0.285115
H  2.245744 1.047849 -1.185967
H  1.994205 1.971682 0.323956
H  -2.897909 1.274648 0.259122
H  -3.630188 -0.247803 0.085593
