program: Gaussian 09
title: 000090367
version: EM64L-G09RevD.01
frameworkgroup: C1[X(C17H24O5)]
method: RPBEPBE
basis: SDD
operation: Freq
keyword: #pfreq=noraman
keyword: PBEPBE/SDD
title: #p freq=noraman PBEPBE/SDD
converged: NO YES NO NO
title: Mulliken charges:
elementType: O O O O O C C C C C C C C C C C C C C C C C H H H H H H H H H H H H H H H H H H H H H H H H
charge: -0.287532 -0.249853 -0.275309 -0.223149 -0.198300 0.186433 -0.107076 -0.711802 -0.716262 0.188845 0.177737 -0.400629 0.396884 -0.228164 -0.221374 -0.391614 -0.397825 -0.671893 -0.673429 -0.218572 -0.226203 -0.241877 0.230036 0.207582 0.247289 0.229724 0.207745 0.258665 0.210529 0.216033 0.225195 0.227795 0.229982 0.227202 0.235145 0.283206 0.226521 0.229333 0.237560 0.211505 0.228662 0.232154 0.213524 0.224967 0.224355 0.226252
chargesum: 0.00000
title: Mulliken charges with hydrogens summed into heavy atoms:
elementType: O O O O O C C C C C C C C C C C C C C C C C
charge: -0.287532 -0.249853 -0.275309 -0.223149 -0.198300 0.186433 0.122960 -0.027207 -0.039322 0.188845 0.177737 0.040600 0.396884 0.229613 0.240973 -0.108408 -0.171304 0.006505 0.000911 0.006395 -0.001847 -0.015625
polarizability: 2.39851000e+02 1.03050640e+00 1.72214134e+02 3.43698630e+00 1.61700076e+01 1.82385439e+02
1716.lowfreq: -17.2163 -3.2024 -0.0011 -0.0003 -0.0001 5.9873 10.1733 17.6648 21.6776
frequency: -13.9780 17.4629 21.2596 26.2157 46.5320 48.9296 63.7062 76.1842 89.1296 93.8346 108.7589 110.9412 129.9136 160.4559 179.6597 198.7120 200.2908 204.7031 229.7481 236.6173 241.8631 260.8278 262.6840 286.3918 310.1740 330.4271 355.2357 369.5661 385.6593 401.4403 418.9277 441.7731 466.7798 481.3184 516.6145 604.8407 617.3032 685.7582 701.7415 715.5624 739.7627 757.2990 788.4241 796.6562 798.2927 804.3309 811.4616 815.8927 856.9215 891.6378 909.8541 927.0334 939.1310 956.6172 979.1965 982.3631 989.1055 990.9240 995.7451 1015.1908 1020.2076 1026.3531 1028.3474 1038.4747 1084.2473 1106.0288 1113.2219 1114.7191 1133.4392 1133.5950 1136.1164 1167.9963 1171.4080 1181.9800 1185.6138 1190.0182 1210.3364 1221.4115 1248.9293 1250.1499 1295.9265 1312.7149 1341.7713 1354.1283 1356.2730 1358.1567 1385.2273 1391.1490 1398.7141 1400.4226 1402.9835 1440.5183 1461.6821 1462.3046 1463.9283 1465.5960 1471.2167 1472.6810 1473.3531 1483.1128 1485.3207 1485.4199 1486.0184 1491.8154 1594.8509 1615.7524 1617.5191 1657.4211 2924.8003 2981.5919 2987.2089 2989.8680 2993.7187 2995.5908 2996.5728 3008.8987 3010.4231 3068.3042 3069.4369 3073.6440 3081.6800 3092.7347 3093.4623 3098.9212 3106.9068 3108.4538 3108.8998 3108.9237 3124.3764 3138.7085 3157.4671 3177.5008
redmass: 3.0301 4.0454 2.8857 3.7650 4.4720 3.1465 3.3141 3.1675 3.2443 2.7201 3.5928 3.5954 3.7695 3.7981 2.1040 2.5874 1.3607 2.5447 2.2183 1.2545 1.4462 1.9603 2.6912 5.4148 3.5293 4.5451 5.3477 3.1148 4.7467 2.8463 3.3036 4.1317 3.0372 3.7055 5.3694 6.3904 6.4025 7.3975 2.3065 6.0635 1.4241 7.0739 7.6063 1.1175 1.1125 3.5830 3.9172 4.0497 1.2507 2.7486 1.3301 1.2601 3.1518 1.6720 1.3969 2.7958 5.4349 2.7318 1.4918 1.7318 2.6835 2.3230 2.7803 5.6729 1.6076 3.3843 2.2533 2.2865 1.4656 1.4774 2.4539 4.0050 1.0592 2.0470 1.2153 3.5363 1.4404 1.6549 1.1359 1.1363 1.4614 1.3811 1.3256 1.3696 1.3999 1.6770 1.1929 3.8161 1.2645 1.2620 1.2014 2.1402 1.0409 1.0406 1.0454 1.0613 1.0761 1.0644 1.0813 1.0908 1.1657 1.7163 1.0720 1.0622 6.2000 10.5855 6.2575 11.5914 1.0592 1.0976 1.0372 1.0410 1.0796 1.0357 1.0359 1.0579 1.0581 1.1068 1.1065 1.0998 1.0992 1.0986 1.0986 1.0988 1.1027 1.0877 1.1024 1.0990 1.0867 1.0931 1.0990 1.0957
irintensity: 0.4778 0.0770 0.2157 0.1042 0.1932 0.8822 0.3099 0.7390 1.9439 1.6181 1.1128 2.8651 0.6908 2.1057 0.6079 3.5018 1.2910 2.1169 2.9418 0.6373 0.1703 1.5282 6.2567 16.0778 7.4196 6.8256 7.7446 6.1596 0.5554 0.5106 1.2716 3.1943 6.2748 8.1380 4.4720 1.4814 0.2890 7.0616 22.9045 4.2355 80.9220 15.0747 0.2112 3.4036 3.0885 1.3817 5.7417 1.0664 0.0547 5.4425 1.7755 1.1090 14.7068 1.5488 0.1758 10.0985 0.2731 47.9011 9.4041 5.9091 36.9317 82.8288 122.0434 178.6429 12.2089 204.4140 5.8889 56.0286 6.9298 10.2664 7.1820 136.2145 1.5137 66.9235 18.9725 140.4418 4.3806 3.2864 0.1260 0.0625 1.5059 9.3721 5.0381 2.4492 1.0439 9.9231 22.0092 7.7308 23.2140 26.4972 20.6638 10.0611 16.1702 6.6869 4.5251 5.2431 2.8235 4.4093 14.3368 17.9920 18.8875 12.5357 0.2625 15.5146 4.0378 191.1068 33.5365 114.1925 25.0506 39.4793 16.3511 35.8725 21.2075 19.3371 17.4571 19.4227 17.6269 8.9999 5.7091 9.6729 59.8071 29.2464 28.1876 24.0537 44.1892 10.3105 36.1296 17.2924 1.2719 33.3668 34.6858 5.1327
temp: 298.150 k
press: 1.00000 atm
elementType: 8 8 8 8 8 6 6 6 6 6 6 6 6 6 6 6 6 6 6 6 6 6 1 1 1 1 1 1 1 1 1 1 1 1 1 1 1 1 1 1 1 1 1 1 1 1
symmnumber: 1
zpe: 991288.2 jmol-1
zpe.correction: 0.377562 hartree
zpe.thermalcorrener: 0.401598 hartree
zpe.thermalcorrenthalpy: 0.402543 hartree
zpe.thermalcorrgfe: 0.321396 hartree
zpe.sumelectzpe: -1036.618829 hartree
zpe.sumelectthermal: -1036.594793 hartree
zpe.sumelectthermalent: -1036.593849 hartree
zpe.sumelectthermalfe: -1036.674995 hartree
dipole: -1.7653 2.0941 -0.9039
dipole: 2.8842
quadrupole: -113.2412 -121.6308 -135.9749
quadrupole: -2.1473 -9.4596 5.4849
quadrupole: 10.3745 1.9848 -12.3593 -2.1473 -9.4596 5.4849
hfenergy: -1036.9963911 hartree
pointgroup: C01 [X(C17H24O5)]
dipole: -0.6117882 -0.8605684 0.4156381 debye
polarizability: 239.3509165|5.0097262|174.5459391|-5.861258|16.2119098|180.553717 unknown
InChI: InChI=1S/C17H24O5/c1-5-20-15(18)17(13(3)4,16(19)21-6-2)22-12-14-10-8-7-9-11-14/h7-11,13H,5-6,12H2,1-4H3
charge 0 multiplicity 1
46 atoms
O  0.439716 0.648073 -0.254649
O  -0.774763 -1.749619 0.664499
O  -2.982542 -0.279498 -0.625679
O  -1.333783 -0.437935 2.500626
O  -1.532371 0.721897 -2.147055
C  -0.938117 0.630081 0.269593
C  -1.321168 2.000362 0.93925
C  -0.927748 3.187552 0.029691
C  -2.811097 2.094123 1.347404
C  -1.07222 -0.545656 1.280968
C  -1.8025 0.368146 -0.984502
C  1.499288 0.761981 0.758318
C  2.835707 0.517751 0.07693
C  -0.832741 -2.969925 1.530061
C  -3.941729 -0.560611 -1.740587
C  2.912928 -0.130739 -1.179326
C  4.029876 0.915609 0.728955
C  -0.454069 -4.151493 0.644561
C  -5.117527 -1.31534 -1.130691
C  4.172434 -0.383537 -1.769607
C  5.287728 0.655752 0.141253
C  5.362893 0.003261 -1.111906
H  -0.726549 2.045345 1.873825
H  -1.061148 4.136341 0.580741
H  0.11862 3.118858 -0.31112
H  -1.562555 3.225583 -0.873865
H  -2.971412 3.031136 1.911319
H  -3.113399 1.251635 1.989533
H  -3.472799 2.117816 0.462616
H  1.485835 1.766014 1.230845
H  1.340979 0.009248 1.56264
H  -0.133142 -2.829314 2.373895
H  -1.856576 -3.049752 1.938314
H  -4.241126 0.403949 -2.189385
H  -3.408767 -1.148944 -2.508945
H  1.985211 -0.410767 -1.68537
H  3.979181 1.432471 1.696453
H  -1.158163 -4.254126 -0.198623
H  0.562376 -4.025255 0.234721
H  -0.478985 -5.08495 1.235982
H  -4.783767 -2.264468 -0.677552
H  -5.613173 -0.713001 -0.350209
H  -5.860007 -1.546524 -1.916112
H  4.223384 -0.879497 -2.745905
H  6.204392 0.967921 0.65456
H  6.337694 -0.193853 -1.572363
