program: Gaussian 09
title: 000090266
version: EM64L-G09RevD.01
frameworkgroup: C1[X(C10H12O3)]
method: RPBEPBE
basis: SDD
operation: Freq
keyword: #pfreq=noraman
keyword: PBEPBE/SDD
title: #p freq=noraman PBEPBE/SDD
converged: YES YES NO NO
title: Mulliken charges:
elementType: O O O C C C C C C C C C C H H H H H H H H H H H H
charge: -0.266867 -0.260873 -0.244637 0.448051 -0.638291 -0.338109 -0.415657 0.318904 -0.347765 -0.348251 0.277438 -0.538344 -0.505801 0.241636 0.235989 0.258093 0.230661 0.250278 0.239469 0.220151 0.220341 0.245172 0.244572 0.231966 0.241873
chargesum: 0.00000
title: Mulliken charges with hydrogens summed into heavy atoms:
elementType: O O O C C C C C C C C C C
charge: -0.266867 -0.260873 -0.244637 0.448051 -0.160665 -0.080016 -0.184995 0.318904 -0.097487 -0.108781 0.277438 0.147320 0.212610
polarizability: 1.62177289e+02 4.80107391e+00 1.09926695e+02 1.03015126e+01 -8.48096628e+00 8.07135866e+01
1716.lowfreq: -7.2632 -5.0606 -0.9040 -0.0007 0.0004 0.0005 16.2872 25.9990 60.9708
frequency: 15.8174 25.9435 60.9638 90.6199 99.5199 145.2711 193.6094 197.5064 235.4334 255.8673 311.4419 341.7969 394.7772 411.6119 415.2228 500.0604 520.8502 590.6622 630.6102 683.5922 711.7430 753.6447 793.2843 809.8918 822.6799 851.8240 930.9203 937.8547 966.8525 975.0575 989.4165 1003.7244 1096.9236 1112.8646 1112.9592 1121.3035 1148.2903 1157.0785 1180.7238 1203.3629 1230.2891 1232.6079 1286.3327 1312.1460 1386.5756 1417.8499 1422.2126 1436.4863 1452.0006 1453.3250 1463.7423 1466.6043 1473.0130 1501.6991 1585.8501 1622.8313 1642.1464 2957.4217 3004.9347 3016.5607 3044.3427 3096.9973 3107.4011 3123.9365 3127.8213 3138.2924 3149.6306 3161.6337 3168.3833
redmass: 3.8642 4.6234 4.3015 1.3736 2.2745 4.1174 3.6038 3.6864 1.2955 2.8750 3.6484 5.0878 2.5160 4.3542 3.2584 3.5129 3.0588 4.8767 6.6460 5.1331 3.5957 4.7770 2.8464 2.2108 1.8390 2.2298 1.7582 1.8353 1.5522 3.1687 8.2871 2.7142 1.7712 1.2601 1.2708 1.4145 1.4353 1.3355 1.2423 2.4610 3.7154 1.7034 1.5101 1.3860 4.8165 2.7993 1.2594 1.1712 1.0513 1.0972 1.0514 1.0502 1.0753 2.3983 7.0146 6.4856 8.9877 1.0331 1.0295 1.0616 1.1039 1.1004 1.1046 1.0986 1.0897 1.0893 1.1048 1.0942 1.0961
irintensity: 0.9645 1.1841 1.2213 1.1241 2.4934 4.9535 7.7178 0.8505 1.6784 11.2949 6.0045 3.5168 5.0656 2.9231 0.5854 8.2026 21.5880 15.8032 0.4448 7.2060 4.4694 7.9585 46.6999 13.8872 3.8116 32.3761 0.9935 1.7612 6.9620 38.7974 35.7881 10.5932 103.5179 0.2025 0.4472 93.8103 5.8746 2.1729 59.8972 4.7104 140.9369 141.9454 42.9529 17.3203 6.0504 2.1725 21.5748 11.0952 19.8844 14.2008 12.7205 13.3037 53.9344 119.8352 9.7497 37.4408 171.3487 67.5694 32.9228 16.8133 50.8599 5.9397 27.2509 32.0963 6.9935 5.6274 15.9468 15.6208 3.6037
temp: 298.150 k
press: 1.00000 atm
elementType: 8 8 8 6 6 6 6 6 6 6 6 6 6 1 1 1 1 1 1 1 1 1 1 1 1
symmnumber: 1
zpe: 522078.1 jmol-1
zpe.correction: 0.198849 hartree
zpe.thermalcorrener: 0.212134 hartree
zpe.thermalcorrenthalpy: 0.213078 hartree
zpe.thermalcorrgfe: 0.156512 hartree
zpe.sumelectzpe: -612.947077 hartree
zpe.sumelectthermal: -612.933792 hartree
zpe.sumelectthermalent: -612.932847 hartree
zpe.sumelectthermalfe: -612.989413 hartree
dipole: -0.7106 -3.1231 0.3736
dipole: 3.2247
quadrupole: -62.6197 -75.6289 -75.0258
quadrupole: 1.1596 -1.1545 2.0559
quadrupole: 8.4718 -4.5374 -3.9343 1.1596 -1.1545 2.0559
hfenergy: -613.1459259 hartree
pointgroup: C01 [X(C10H12O3)]
dipole: 0.1900255 1.198192 0.3711843 debye
dipolederiv: -1.5995901 -0.4209458 0.2773649 -0.3445834 -0.4329216 0.0659629 0.3995299 0.1183773 -0.3909009 -0.8916517 0.3802026 -0.210318 0.6341283 -0.8920705 0.1347904 -0.3348603 0.0758964 -0.4563597 -0.5919165 -0.0941912 -0.1668288 0.1150276 -0.802173 -0.0623881 -0.2087598 -0.3226933 -0.5043494 0.2713742 0.0042779 -0.0317388 0.0730958 -0.1306493 -0.0595705 -0.1944993 -0.0418139 -0.1534977 -0.3019169 -0.0002135 -0.1682009 -0.0513011 0.0644049 0.0203531 -0.1293166 -0.0094262 0.0268532 0.039019 0.0155005 -0.0853622 0.0497794 0.0311587 0.078865 -0.0441945 0.1177356 -0.0450639 0.0170128 0.1014639 -0.0470724 0.0340592 0.0780849 0.126558 -0.0783723 0.0656811 -0.0547796 1.3905675 0.2925493 -0.3681025 0.0944931 0.0681519 -0.0586369 -0.5390133 -0.1515749 0.2330248 -0.3480368 -0.0372516 0.0372723 -0.254159 -0.048798 0.1632317 -0.0601896 0.0879576 -0.0921026 -0.3320158 -0.0452947 0.006239 0.2291943 -0.0318852 -0.0080199 0.2005983 0.1183952 -0.2045833 1.063324 -0.2740132 0.4304054 -0.6880118 1.3343126 -0.0084179 0.6356737 0.3127686 0.569128 0.5934322 0.1731804 -0.0042958 0.4683028 0.4955658 -0.0909135 0.1400372 0.0157539 0.2787977 0.5007907 -0.1063049 0.0867128 -0.0716983 0.2841369 -0.0644699 0.1838376 -0.1270587 0.3443602 0.0117823 -0.0164525 0.0160274 -0.0593337 -0.0484409 0.101063 0.0176391 0.0439106 0.0436581 0.0554289 0.0003575 0.0108284 0.0563474 0.0065416 -0.1173394 0.0238061 -0.0643321 0.0095542 0.0706989 -0.0988767 -0.0013878 -0.0865849 0.0113419 -0.041655 -0.0104422 -0.0439589 0.113832 0.0479811 0.0552762 0.0862379 0.0556402 0.0145746 -0.0924983 0.0728547 -0.095137 0.053287 0.0626567 0.0415849 0.064803 0.0387202 0.0416781 -0.0875157 0.0740293 -0.0899557 0.0873529 0.0284923 -0.1009809 -0.0019101 -0.1181407 -0.0156799 -0.0561291 0.0031833 -0.0582069 0.1362882 0.0530119 -0.0165923 -0.0014623 -0.1166083 0.012669 0.008472 -0.1400089 -0.0553022 -0.1557929 0.0134205 0.1134293 -0.0581886 -0.0609588 -0.1517335 0.0877779 -0.0764994 0.0366517 0.0523746 -0.1185673 -0.021577 0.0945724 0.0154292 0.0928604 -0.024873 0.1207887 -0.007246 0.0648619 -0.0171973 0.027267 0.0824095 0.0134283 0.0972724 -0.0334411 -0.007023 0.0414629 -0.0961628 0.0509815 0.069767 -0.0239891 0.1191057 -0.0832155 -0.00095 -0.0149034 -0.0333814 0.091128 -0.0690821 -0.0421624 -0.0240155 -0.1453716 0.0048136 0.0197444 -0.0338953 0.0654964 0.0490917 unknown
polarizability: 160.219777|11.4494154|107.2331287|-11.9327055|12.2234802|85.3646652 unknown
InChI: InChI=1S/C10H12O3/c1-12-9-5-3-8(4-6-9)7-10(11)13-2/h3-6H,7H2,1-2H3
charge 0 multiplicity 1
25 atoms
O  3.629886 0.037929 -0.775894
O  -3.389291 0.657579 0.154398
O  -2.979296 -1.520689 -0.563164
C  -0.289655 -0.390926 0.796148
C  -1.704299 -0.586033 1.344407
C  0.303971 -1.37263 -0.043458
C  0.4547 0.768724 1.107027
C  2.340951 -0.032732 -0.222313
C  1.604003 -1.199927 -0.548631
C  1.765387 0.958791 0.608772
C  -2.737438 -0.576884 0.22346
C  4.430495 1.225345 -0.472003
C  -4.373382 0.79967 -0.947817
H  -1.784822 -1.56524 1.850562
H  -1.94992 0.207472 2.067632
H  -0.265893 -2.269973 -0.310263
H  0.010544 1.540986 1.746365
H  2.069657 -1.950145 -1.194934
H  2.314279 1.867752 0.872536
H  4.618212 1.318197 0.61575
H  3.941851 2.147459 -0.843335
H  5.383053 1.072683 -1.000301
H  -3.871564 0.677141 -1.92228
H  -4.777831 1.814965 -0.833587
H  -5.167097 0.039885 -0.851881
