program: Gaussian 09
title: 000090279
version: EM64L-G09RevD.01
frameworkgroup: C1[X(C18H13BrO2)]
method: RPBEPBE
basis: SDD
operation: Freq
keyword: #p
keyword: freq=noraman
keyword: PBEPBE/SDD
title: #p freq=noraman PBEPBE/SDD
converged: YES YES NO NO
title: Mulliken charges:
elementType: Br O O C C C C C C C C C C C C C C C C C C H H H H H H H H H H H H H
charge: -0.008765 -0.303720 -0.306256 0.352016 0.361814 -0.498920 -0.410233 -0.409161 0.351426 0.336359 -0.161427 -0.295156 -0.384981 -0.343919 -0.383250 -0.164621 -0.179010 -0.192824 -0.193981 -0.233181 -0.255591 0.312528 0.261572 0.261425 0.233741 0.284586 0.263298 0.257961 0.258096 0.237926 0.235568 0.230733 0.253791 0.232161
chargesum: 0.00000
title: Mulliken charges with hydrogens summed into heavy atoms:
elementType: Br O O C C C C C C C C C C C C C C C C C C
charge: -0.008765 -0.303720 -0.306256 0.352016 0.361814 -0.186391 -0.148661 -0.147736 0.351426 0.336359 0.072313 -0.010571 -0.121683 -0.085959 -0.125154 -0.164621 0.058916 0.042745 0.036751 0.020610 -0.023430
polarizability: 2.28375243e+02 2.10620394e+01 2.54323477e+02 -1.92333647e+01 -7.93718687e+00 1.61400131e+02
1716.lowfreq: -4.0027 -0.0005 0.0001 0.0008 4.3024 6.0768 16.4578 23.8479 27.7666
frequency: 15.2141 23.7305 27.5680 36.2618 46.8362 73.6188 157.8965 162.9593 190.9565 217.7280 232.4563 255.9319 287.7565 300.8625 312.4533 329.0800 396.9393 409.1001 436.6788 446.0722 479.3447 527.3023 551.0511 558.6087 565.4090 592.6406 613.3544 637.1898 649.1018 675.8684 683.0539 690.5717 711.3398 762.1178 779.3453 790.6264 801.1480 831.7397 847.2887 867.7276 886.3703 889.9360 892.6222 909.7964 947.3526 967.7291 971.1821 972.7784 978.4546 984.8969 987.3043 988.7976 1018.4000 1057.5253 1072.7485 1076.9020 1088.7360 1115.7733 1159.6842 1163.4347 1167.4863 1170.7832 1185.7542 1196.6045 1246.0097 1278.3036 1286.2563 1306.1778 1373.3962 1381.4774 1391.0382 1414.0655 1427.6594 1442.0421 1452.4811 1467.9549 1474.7881 1570.6644 1587.4502 1596.4397 1598.4325 1606.6395 1616.2928 3132.5160 3141.1365 3147.1605 3147.5591 3155.9692 3164.8842 3168.2691 3174.0548 3174.2987 3175.0786 3177.2648 3183.7705 3184.1637
redmass: 7.6253 5.5731 6.1117 5.2955 5.0917 5.9112 6.0305 5.8436 4.7499 4.6180 5.0606 6.3309 10.6487 6.3487 4.9581 6.2099 5.3591 2.8999 3.0576 3.1739 3.3999 5.5991 5.5470 7.3742 7.4574 6.0428 6.6577 5.6028 7.1191 2.4259 2.5545 2.4177 3.8021 1.6420 1.3786 1.5123 5.6555 1.2755 5.1624 1.5551 1.4106 1.3917 1.4533 1.4184 4.1192 1.3699 1.3174 1.3322 5.7094 6.0834 4.9976 1.3816 2.0781 2.0047 1.5280 1.4941 1.5126 1.6991 1.4681 1.2114 1.1433 1.0947 1.8666 3.0301 5.6464 1.3587 1.3249 1.3352 7.3452 8.3840 9.5681 3.0696 2.9839 2.3400 2.3542 2.3607 2.4711 6.8349 6.7306 6.6727 6.8084 6.7276 7.3163 1.0851 1.0891 1.0878 1.0878 1.0931 1.0964 1.0921 1.0930 1.0928 1.1004 1.0923 1.0987 1.0986
irintensity: 0.2513 0.8879 0.1129 0.0363 1.0618 0.6041 0.4287 0.3531 0.0269 1.3864 1.8725 2.4715 3.1702 1.0862 1.1999 5.1923 5.2499 0.3550 8.7070 7.0969 15.7808 0.8547 4.3926 1.1986 0.1541 1.7168 0.5452 1.5084 7.6235 31.0959 34.5990 23.7551 10.2594 77.0600 76.9644 30.1491 17.0688 0.3527 75.3349 43.7791 0.6337 12.5444 9.2036 3.3784 112.2218 0.3742 1.5594 0.9264 8.5713 3.3219 0.3866 0.5459 11.5598 14.9350 14.2986 12.5312 6.0337 48.8864 50.9407 12.0822 18.9126 8.3806 6.4908 231.9849 358.9715 36.6022 12.6499 0.2602 10.1866 5.9732 3.6787 21.2056 13.9833 2.6427 174.4717 229.4268 59.0352 73.0951 161.6343 99.2502 179.2374 4.4637 5.9397 1.5124 7.6401 15.4848 7.7170 27.6666 12.5845 1.6100 2.4961 3.6422 7.6481 1.1717 6.4421 3.9457
temp: 298.150 k
press: 1.00000 atm
elementType: 35 8 8 6 6 6 6 6 6 6 6 6 6 6 6 6 6 6 6 6 6 1 1 1 1 1 1 1 1 1 1 1 1 1
symmnumber: 1
zpe: 666736.7 jmol-1
zpe.correction: 0.253947 hartree
zpe.thermalcorrener: 0.271647 hartree
zpe.thermalcorrenthalpy: 0.272591 hartree
zpe.thermalcorrgfe: 0.204181 hartree
zpe.sumelectzpe: -856.153406 hartree
zpe.sumelectthermal: -856.135706 hartree
zpe.sumelectthermalent: -856.134761 hartree
zpe.sumelectthermalfe: -856.203171 hartree
dipole: -0.2894 -0.0662 1.0416
dipole: 1.0831
quadrupole: -127.5762 -122.0519 -126.1234
quadrupole: 0.1144 -6.2672 -5.7907
quadrupole: -2.3257 3.1986 -0.8729 0.1144 -6.2672 -5.7907
hfenergy: -856.4073526 hartree
pointgroup: C01 [X(C18H13Br1O2)]
dipole: 0.1438111 0.156018 0.3695462 debye
polarizability: 220.4195583|10.5406529|265.1915042|6.0433966|-12.5258849|158.4877884 unknown
InChI: InChI=1S/C18H13BrO2/c19-14-6-4-9-16(12-14)21-18-11-5-10-17(13-18)20-15-7-2-1-3-8-15/h1-13H
charge 0 multiplicity 1
34 atoms
Br 2.477612 2.453811 -2.42048
O  1.910322 -1.875281 0.743147
O  -2.868289 -0.76659 0.08246
C  0.600019 -2.164119 0.271019
C  -1.738752 -1.606535 -0.040625
C  -0.44586 -1.2208 0.379782
C  0.378913 -3.470753 -0.210286
C  -1.993182 -2.908639 -0.530191
C  2.512652 -0.623071 0.489847
C  -2.743725 0.649749 0.076463
C  -0.930444 -3.833418 -0.600553
C  2.204845 0.155584 -0.652798
C  3.513952 -0.218532 1.400921
C  -1.878808 1.337069 -0.80653
C  -3.617049 1.350482 0.935695
C  2.910547 1.358165 -0.843074
C  4.206534 0.987761 1.168969
C  -1.881023 2.749707 -0.806036
C  -3.614862 2.762715 0.918572
C  3.910405 1.799063 0.046679
C  -2.74427 3.467834 0.054338
H  -0.262835 -0.227985 0.799611
H  1.215712 -4.171456 -0.269212
H  -3.008671 -3.171494 -0.838225
H  -1.12029 -4.844504 -0.975383
H  1.45184 -0.177128 -1.371016
H  3.73077 -0.849903 2.266851
H  -1.225581 0.785081 -1.489587
H  -4.280319 0.784209 1.5963
H  4.982494 1.309937 1.871101
H  -1.206474 3.284309 -1.483977
H  -4.290814 3.310342 1.584379
H  4.44137 2.738734 -0.12442
H  -2.740739 4.562756 0.048458
