program: Gaussian 09
title: 000090307
version: EM64L-G09RevD.01
frameworkgroup: C1[X(C15H23NO4)]
method: RPBEPBE
basis: SDD
operation: Freq
keyword: #p
keyword: freq=noraman
keyword: PBEPBE/SDD
title: #p freq=noraman PBEPBE/SDD
converged: YES YES NO NO
title: Mulliken charges:
elementType: O O O O N C C C C C C C C C C C C C C C H H H H H H H H H H H H H H H H H H H H H H H
charge: -0.282402 -0.271276 -0.266800 -0.238659 -0.109287 -0.384452 -0.328574 -0.326382 -0.260838 -0.668948 -0.669929 0.166089 0.187208 0.084171 -0.349296 0.236183 -0.234064 -0.341914 -0.515631 -0.535454 0.215183 0.214486 0.210075 0.191848 0.205927 0.189463 0.238309 0.229129 0.207090 0.229271 0.206753 0.206514 0.228677 0.208533 0.262763 0.227867 0.243176 0.228598 0.239825 0.234099 0.225783 0.220011 0.246874
chargesum: 0.00000
title: Mulliken charges with hydrogens summed into heavy atoms:
elementType: O O O O N C C C C C C C C C C C C C C C
charge: -0.282402 -0.271276 -0.266800 -0.238659 -0.109287 0.045216 0.073348 0.069008 0.206600 -0.025833 -0.026205 0.166089 0.187208 0.084171 -0.086533 0.236183 -0.006197 -0.098737 0.186891 0.157214
polarizability: 2.59556509e+02 4.73583172e-02 1.97804240e+02 -9.82278626e+00 3.46411404e+00 1.22218500e+02
1716.lowfreq: -3.6043 -0.0006 0.0003 0.0005 2.9108 10.5290 11.6998 24.5341 34.3100
frequency: 11.5707 24.0694 34.2833 47.3913 62.4094 65.2748 76.6829 82.0975 88.9246 108.8759 127.4632 146.2107 153.2504 170.9430 192.8846 197.8344 215.0130 221.3399 241.0018 269.6460 276.9733 288.4740 308.0912 320.2882 329.7580 360.5910 416.1040 426.9843 455.1659 472.3309 491.7896 520.1070 565.0241 595.0327 617.0325 702.5759 725.5102 742.4053 752.0765 782.0474 786.5904 794.7494 797.2713 808.2174 849.0680 888.0977 912.1241 926.3259 954.3360 966.9936 989.7546 1008.8621 1061.8027 1063.4524 1076.5292 1080.3347 1085.1940 1094.6939 1106.5113 1112.0480 1112.3483 1122.8440 1150.7029 1155.4129 1163.8851 1189.1899 1205.4025 1209.2117 1229.1366 1240.9200 1254.9293 1275.4229 1285.9186 1290.6591 1324.8848 1362.3998 1367.4817 1374.0852 1385.4441 1387.3631 1387.7507 1414.2452 1431.6436 1451.8934 1457.6083 1460.1772 1462.4263 1466.2758 1468.0382 1469.2360 1470.8850 1471.4975 1475.9783 1479.6345 1484.4544 1487.2232 1491.0364 1578.3970 1595.2275 1623.5348 2855.2118 2864.7547 2910.3348 2961.4461 2981.5735 2982.7171 2983.6354 3017.7050 3024.5862 3035.5492 3050.4904 3051.9463 3073.9547 3076.0371 3085.4238 3090.1194 3091.3825 3093.2317 3125.7776 3127.2874 3140.9951 3162.6505 3181.5589
redmass: 3.7619 4.2820 4.0768 4.2540 3.1086 2.7066 3.2200 2.5080 2.5759 3.5651 2.9211 1.6014 1.5302 3.0391 1.7551 2.3208 1.7479 1.7982 2.2673 2.0162 2.8714 2.2001 2.4864 5.4503 4.4896 3.5397 3.4727 5.0673 2.8608 5.4672 3.1173 6.0929 3.7061 5.9938 5.1193 7.4929 6.1628 3.0111 1.7529 2.3506 1.4260 1.1676 1.3830 2.7869 5.8182 1.4200 2.1440 5.5239 8.6670 1.3356 2.3208 8.2098 1.7226 2.6105 1.9045 2.1394 2.1853 2.8219 1.2806 1.4027 2.6898 1.7363 1.3792 1.3379 1.4016 1.2913 3.8665 2.2473 1.6838 2.0118 3.2525 1.1106 1.2341 1.2496 1.3872 1.3392 1.3588 7.1225 1.3791 1.3061 1.2406 1.3983 1.3576 1.8910 1.9331 1.0812 1.0524 1.0568 1.0512 1.0768 1.0675 1.0594 1.1770 1.0522 1.0732 1.0719 1.0775 6.1318 7.6099 11.4490 1.0721 1.0713 1.0704 1.0329 1.0357 1.0291 1.0357 1.0575 1.0875 1.0873 1.1040 1.0903 1.0985 1.0982 1.1059 1.1079 1.1004 1.1004 1.1026 1.0995 1.0866 1.0930 1.0969
irintensity: 0.3947 0.8433 1.6202 1.0346 3.9556 3.8728 1.5760 0.9599 1.3008 7.7646 3.8289 0.1335 2.4442 2.4911 2.5328 0.6152 0.5019 0.8565 1.7386 2.3085 7.5233 2.6925 2.3478 10.7970 7.3958 1.1648 10.9734 2.1729 18.0825 2.2641 1.5734 3.2769 2.4646 3.9828 5.7850 13.6533 4.7550 10.4020 51.3738 16.7780 19.5487 1.6029 14.2603 10.3130 22.5866 0.0904 2.1025 31.1245 59.1333 3.5859 14.9362 385.8028 29.5205 53.2908 23.3066 43.1600 3.1117 4.3878 7.7532 17.3499 102.3763 9.7163 5.4870 10.5388 4.2216 4.3399 108.5824 37.8902 18.5192 44.7518 438.3498 0.8992 2.6188 25.8804 14.5962 2.2405 7.8747 20.4393 16.5726 14.0332 17.5433 30.7227 13.1921 12.5501 157.3023 6.4582 5.6810 13.3262 12.6050 11.7065 0.8665 2.9419 7.6736 5.0706 14.9810 11.3090 10.4849 27.5204 4.3541 193.2787 39.6574 160.0614 81.0701 69.7501 32.2964 62.7060 32.9250 22.0815 14.1885 17.1965 45.3763 12.5360 44.5753 75.2277 24.1334 40.4210 34.9726 42.7280 22.2092 23.5578 5.7254 14.2177 8.6552
temp: 298.150 k
press: 1.00000 atm
elementType: 8 8 8 8 7 6 6 6 6 6 6 6 6 6 6 6 6 6 6 6 1 1 1 1 1 1 1 1 1 1 1 1 1 1 1 1 1 1 1 1 1 1 1
symmnumber: 1
zpe: 937463.5 jmol-1
zpe.correction: 0.357061 hartree
zpe.thermalcorrener: 0.380021 hartree
zpe.thermalcorrenthalpy: 0.380965 hartree
zpe.thermalcorrgfe: 0.301767 hartree
zpe.sumelectzpe: -939.427693 hartree
zpe.sumelectthermal: -939.404733 hartree
zpe.sumelectthermalent: -939.403788 hartree
zpe.sumelectthermalfe: -939.482986 hartree
dipole: 1.6580 -2.7104 -0.5121
dipole: 3.2183
quadrupole: -80.3552 -115.4511 -123.7384
quadrupole: -4.7422 3.5814 0.2139
quadrupole: 26.1597 -8.9362 -17.2235 -4.7422 3.5814 0.2139
hfenergy: -939.7847536 hartree
pointgroup: C01 [X(C15H23N1O4)]
dipole: -0.6618375 1.0735938 -0.11203 debye
polarizability: 259.7269361|-0.2062124|197.8765809|8.5540845|2.5206913|121.9757323 unknown
InChI: InChI=1S/C15H23NO4/c1-5-16(6-2)10-11-20-15(17)12-8-7-9-13(18-3)14(12)19-4/h7-9H,5-6,10-11H2,1-4H3
charge 0 multiplicity 1
43 atoms
O  0.915311 0.4643 0.196635
O  -2.588922 -1.667625 -0.168795
O  -5.026213 -0.402884 -0.224554
O  -0.058515 -1.415152 1.169925
N  4.637361 0.166623 -0.11326
C  3.274299 0.721649 -0.299863
C  4.958354 -0.918686 -1.080684
C  5.696435 1.205284 -0.019252
C  2.257469 -0.125435 0.47462
C  5.983109 -1.929023 -0.530827
C  5.693764 1.94238 1.333583
C  -1.467936 0.429829 0.367985
C  -0.185746 -0.296804 0.616797
C  -2.659193 -0.301423 0.115255
C  -1.50761 1.848489 0.455417
C  -3.902066 0.400682 0.013119
C  -2.733253 2.526527 0.344085
C  -3.934444 1.808524 0.133306
C  -3.144947 -2.589704 0.844426
C  -6.309347 0.274307 -0.428835
H  3.241853 1.75513 0.087516
H  2.97411 0.771221 -1.372654
H  4.019995 -1.458717 -1.307074
H  5.321014 -0.499983 -2.053449
H  6.671854 0.700034 -0.140744
H  5.618616 1.94641 -0.855068
H  2.452266 -0.090333 1.560804
H  2.256841 -1.183071 0.156376
H  6.176357 -2.726186 -1.272923
H  5.599795 -2.390689 0.395534
H  6.950404 -1.448979 -0.295892
H  6.509018 2.689212 1.369097
H  5.835214 1.221861 2.157793
H  4.742874 2.477968 1.509319
H  -0.574843 2.39263 0.622809
H  -2.76535 3.61807 0.423827
H  -4.880277 2.352487 0.05043
H  -3.05736 -3.59132 0.397779
H  -2.534945 -2.533288 1.763781
H  -4.204684 -2.354168 1.04784
H  -6.263585 0.965298 -1.292609
H  -6.62279 0.829629 0.476771
H  -7.027291 -0.532474 -0.636145
