program: Gaussian 09
title: 000090249
version: EM64L-G09RevD.01
frameworkgroup: C1[X(C16H19N)]
method: RPBEPBE
basis: SDD
operation: Freq
keyword: #pfreq=noraman
keyword: PBEPBE/SDD
title: #p freq=noraman PBEPBE/SDD
converged: YES YES NO NO
title: Mulliken charges:
elementType: N C C C C C C C C C C C C C C C C H H H H H H H H H H H H H H H H H H H
charge: -0.460785 -0.045179 -0.480273 -0.420969 -0.413187 -0.394240 -0.377069 0.324579 0.165909 -0.413659 0.437421 -0.350275 -0.246601 -0.489057 -0.430624 -0.279516 -0.245737 0.223248 0.219362 0.203364 0.191152 0.228862 0.186686 0.208685 0.200755 0.209417 0.191966 0.202792 0.294604 0.233149 0.190128 0.217372 0.233857 0.235245 0.223405 0.225211
chargesum: 0.00000
title: Mulliken charges with hydrogens summed into heavy atoms:
elementType: N C C C C C C C C C C C C C C C C
charge: -0.166181 0.178069 -0.057546 -0.000955 -0.017815 0.015932 0.017688 0.324579 0.165909 -0.180509 0.437421 -0.160147 -0.029230 -0.255200 -0.195379 -0.056111 -0.020526
polarizability: 2.39471693e+02 -8.95286057e+00 2.02070453e+02 1.28043670e+01 -5.68612036e-02 1.05437605e+02
1716.lowfreq: -3.3315 -0.0007 -0.0004 0.0003 5.6830 12.9881 38.3169 47.8513 77.6763
frequency: 38.0551 47.4919 77.6642 97.8887 163.2649 180.4768 202.7323 223.5309 262.2686 304.8348 315.7270 360.9015 392.3530 424.0099 442.2749 449.8606 474.3085 482.1533 499.6440 523.4345 571.5513 613.4499 644.1972 650.9802 730.2613 737.1213 772.8866 776.3190 779.8771 793.7358 799.5532 829.4441 847.7193 860.8562 871.0254 873.4867 878.7341 928.8040 942.3390 963.7137 980.3406 983.8848 1008.3106 1033.4659 1042.2103 1058.3963 1065.9187 1091.8857 1099.1460 1120.3935 1148.6551 1152.1553 1167.8633 1178.9950 1194.5558 1233.1502 1245.6647 1261.9732 1263.0218 1274.8710 1293.0741 1311.8099 1329.4181 1333.9784 1339.3329 1353.0319 1358.4697 1360.9081 1368.0928 1411.6156 1415.5959 1447.5676 1451.8690 1457.4317 1463.3584 1470.0292 1474.0418 1478.3965 1490.2596 1539.6638 1591.8020 1596.2572 1629.5093 2956.4790 2957.0241 2966.0232 2974.7965 2979.0519 2987.2782 3026.7508 3030.2976 3039.0722 3042.1482 3048.8139 3108.0429 3120.1138 3123.1942 3138.2831 3146.0027 3159.1476 3165.7110 3587.5567
redmass: 4.0885 3.5063 3.4559 3.2775 3.4091 3.8321 2.4651 3.3346 3.3283 1.8794 1.4715 2.2399 2.4319 2.5717 3.8277 3.5271 3.1640 2.0741 5.1684 5.8011 3.0968 4.2368 3.2179 2.8890 1.3288 4.7290 1.5784 1.5616 4.7096 1.9955 3.1030 2.0233 1.5814 2.2528 2.3605 2.1416 1.9612 1.3995 1.3841 1.3288 2.8538 1.3513 2.6869 2.4546 1.6469 1.7154 1.9686 1.7676 1.9281 1.0899 1.5041 1.7476 1.8493 1.1010 1.3654 1.8320 1.3447 1.3675 1.4043 1.3485 1.5343 1.6354 1.7176 1.3221 1.4418 1.6667 1.4272 1.3982 1.7741 4.2184 3.0355 2.4541 2.0547 1.1017 1.0938 1.0942 1.1040 1.4376 1.5399 2.9128 5.2689 6.9717 6.0408 1.0770 1.0685 1.0617 1.0645 1.0626 1.0664 1.0938 1.0978 1.0992 1.1014 1.1020 1.0858 1.0871 1.0856 1.0939 1.0939 1.1003 1.0954 1.0756
irintensity: 0.3198 0.0555 0.9517 2.0648 0.1647 0.6646 0.2806 0.9441 3.4243 10.2560 40.9651 3.1787 3.1546 24.5104 4.2722 2.5304 0.0247 0.1748 0.5937 1.0881 15.7998 2.1950 7.0314 7.9257 2.0085 1.8813 106.7285 12.5903 2.1480 25.7315 8.7450 3.6470 8.6264 8.2614 2.4229 1.2674 7.6188 9.0844 2.3879 1.4435 1.5396 1.2666 10.0520 11.0982 1.5807 0.3145 1.0287 3.0460 14.8903 3.5100 11.1176 2.8322 16.8717 0.3806 3.2513 0.6446 4.9521 0.6370 3.8061 18.4252 2.6711 31.6224 31.3468 1.0730 0.4174 2.8524 2.3121 7.8369 14.2821 3.3065 106.1044 35.7263 0.7333 18.7081 4.5661 14.2057 8.8284 106.0636 36.8663 189.6713 85.5936 116.4551 9.4292 10.2306 27.5531 43.6988 29.6557 29.3147 63.1464 85.1236 59.2208 19.7791 19.0770 129.3443 14.6957 1.8374 5.0445 31.7013 41.7270 41.9325 20.4973 24.4086
temp: 298.150 k
press: 1.00000 atm
elementType: 7 6 6 6 6 6 6 6 6 6 6 6 6 6 6 6 6 1 1 1 1 1 1 1 1 1 1 1 1 1 1 1 1 1 1 1
symmnumber: 1
zpe: 813192.0 jmol-1
zpe.correction: 0.309728 hartree
zpe.thermalcorrener: 0.324118 hartree
zpe.thermalcorrenthalpy: 0.325062 hartree
zpe.thermalcorrgfe: 0.268224 hartree
zpe.sumelectzpe: -674.632859 hartree
zpe.sumelectthermal: -674.618469 hartree
zpe.sumelectthermalent: -674.617525 hartree
zpe.sumelectthermalfe: -674.674363 hartree
dipole: -2.5907 -0.7964 -0.2675
dipole: 2.7236
quadrupole: -92.8820 -94.5406 -107.6755
quadrupole: -1.0180 3.0805 0.3536
quadrupole: 5.4841 3.8254 -9.3095 -1.0180 3.0805 0.3536
hfenergy: -674.9425871 hartree
pointgroup: C01 [X(C16H19N1)]
dipole: -1.015715 -0.3237674 -0.1080893 debye
polarizability: 239.7182593|-8.6878894|201.8441906|12.4605962|1.4569947|105.4173018 unknown
InChI: InChI=1S/C16H19N/c1-2-9-14(10-3-1)17-16-12-6-8-13-7-4-5-11-15(13)16/h4-8,11-12,14,17H,1-3,9-10H2
charge 0 multiplicity 1
36 atoms
N  -0.989001 -0.041648 -0.510615
C  -2.279255 0.649657 -0.68552
C  -3.2813 -0.302214 -1.38996
C  -2.87531 1.150956 0.664752
C  -3.736841 -1.472049 -0.482106
C  -3.318606 -0.017833 1.574695
C  -4.321164 -0.950295 0.852559
C  0.234098 0.583525 -0.278621
C  1.437284 -0.225742 -0.107243
C  0.347204 1.9912 -0.21543
C  2.708074 0.438551 0.109354
C  1.419943 -1.658788 -0.144419
C  1.60695 2.618628 -0.003003
C  2.773843 1.869977 0.158212
C  3.889421 -0.360002 0.272477
C  2.588083 -2.411274 0.01815
C  3.838889 -1.754392 0.228176
H  -2.112214 1.525108 -1.347386
H  -2.834761 -0.682568 -2.329365
H  -4.172364 0.291687 -1.673315
H  -3.748234 1.798163 0.4386
H  -2.1325 1.779433 1.190222
H  -2.886209 -2.152823 -0.265355
H  -4.487392 -2.083623 -1.018676
H  -3.768718 0.381399 2.503774
H  -2.425561 -0.599921 1.879533
H  -5.255916 -0.389252 0.642819
H  -4.597375 -1.799489 1.50699
H  -1.005695 -1.05692 -0.575092
H  -0.538937 2.620135 -0.336034
H  0.481698 -2.205858 -0.298688
H  1.647872 3.713405 0.034337
H  3.740664 2.357706 0.323572
H  4.844879 0.153578 0.434856
H  2.544386 -3.505473 -0.01401
H  4.751864 -2.346745 0.35466
