program: Gaussian 09
title: 000090191
version: EM64L-G09RevD.01
frameworkgroup: C1[X(C10H15N)]
method: RPBEPBE
basis: SDD
operation: Freq
keyword: #pfreq=noraman
keyword: PBEPBE/SDD
title: #p freq=noraman PBEPBE/SDD
converged: YES YES NO NO
title: Mulliken charges:
elementType: N C C C C C C C C C C H H H H H H H H H H H H H H H
charge: -0.015443 -0.468311 -0.356602 0.181574 0.498243 -0.532398 -0.349249 -0.326856 -0.688036 -0.557269 -0.672949 0.215323 0.195594 0.200392 0.229917 0.211475 0.210896 0.235603 0.239213 0.212932 0.207768 0.218787 0.244462 0.225637 0.219228 0.220071
chargesum: 0.00000
title: Mulliken charges with hydrogens summed into heavy atoms:
elementType: N C C C C C C C C C C
charge: -0.015443 -0.057394 0.073706 0.181574 0.498243 -0.110027 -0.113646 -0.087643 -0.048549 -0.312808 -0.008014
polarizability: 1.58868800e+02 2.78976949e+00 1.04291152e+02 -2.46437239e+00 6.48906461e+00 7.81043651e+01
1716.lowfreq: -6.0774 -0.0010 -0.0009 -0.0008 3.1586 12.3036 31.9649 37.6430 61.5503
frequency: 31.7831 37.3690 61.5342 78.3698 143.3809 202.7556 227.5488 233.5460 290.0776 299.6071 382.7884 398.1712 435.0802 484.3465 586.6030 636.5704 720.2622 743.1777 780.5554 785.9545 823.1534 851.9629 867.6642 895.1111 931.3870 965.2185 975.6849 1007.1840 1043.3961 1052.9621 1062.9576 1075.2007 1094.2508 1142.4688 1214.5518 1220.8702 1236.4361 1245.0743 1277.2567 1285.7024 1305.5529 1314.9928 1319.2241 1338.1679 1380.3499 1386.8261 1388.8018 1460.8629 1469.9788 1472.1601 1474.5030 1476.3680 1476.4305 1485.4527 1488.0800 1556.3907 1593.1945 2971.0601 2979.4278 2980.8009 2985.1311 2988.7142 3029.2374 3036.9415 3051.9159 3071.7083 3073.8478 3079.8042 3084.9389 3103.0984 3119.0693 3148.5814
redmass: 2.6552 3.0407 2.8015 1.8677 3.4169 1.1761 1.1085 3.5084 3.0246 1.9189 2.4362 3.1690 4.3691 3.5141 2.8123 7.3365 3.2458 1.1422 1.9643 1.7030 2.8612 1.7136 1.3416 1.9033 1.4062 2.5446 1.3700 2.6685 1.6228 2.8376 2.0232 1.3834 2.1598 1.2522 1.5169 2.9772 1.5837 1.3282 1.1837 1.6572 1.8901 1.6409 2.0569 1.5040 2.0695 1.2200 1.1991 1.0988 1.4491 1.0772 1.0844 1.1365 1.3131 1.0810 1.1241 5.5492 6.3577 1.0356 1.0603 1.0356 1.0599 1.0602 1.0979 1.1012 1.1026 1.0996 1.1018 1.1001 1.1011 1.0913 1.0888 1.0968
irintensity: 1.2482 0.5548 0.7235 0.1031 0.1000 0.1658 0.0261 0.2745 0.2110 0.6623 1.5919 1.7819 2.8611 3.9351 11.0143 1.5672 1.9715 5.5518 1.6601 2.8150 10.3421 18.2462 6.2322 1.2292 3.4954 7.4727 0.1780 5.1459 1.2229 0.5691 14.9080 0.6592 22.3101 6.0273 0.9915 1.3003 1.5929 1.4921 2.8445 3.1780 1.6403 3.9596 0.1263 2.7040 20.0934 7.0479 9.6560 2.0246 20.3645 15.5807 2.0755 17.6009 29.3690 16.3077 24.5648 15.5530 12.8586 45.0235 4.7764 40.1052 35.9911 57.0852 0.8501 8.0826 1.8274 55.7314 75.6556 56.0027 38.2435 33.4864 17.0665 16.9476
temp: 298.150 k
press: 1.00000 atm
elementType: 7 6 6 6 6 6 6 6 6 6 6 1 1 1 1 1 1 1 1 1 1 1 1 1 1 1
symmnumber: 1
zpe: 591670.5 jmol-1
zpe.correction: 0.225355 hartree
zpe.thermalcorrener: 0.237214 hartree
zpe.thermalcorrenthalpy: 0.238158 hartree
zpe.thermalcorrgfe: 0.185952 hartree
zpe.sumelectzpe: -443.974125 hartree
zpe.sumelectthermal: -443.962266 hartree
zpe.sumelectthermalent: -443.961322 hartree
zpe.sumelectthermalfe: -444.013528 hartree
dipole: -1.4346 1.6190 0.8101
dipole: 2.3099
quadrupole: -60.0022 -65.8192 -70.5092
quadrupole: 1.9369 0.4883 0.0070
quadrupole: 5.4413 -0.3757 -5.0657 1.9369 0.4883 0.0070
hfenergy: -444.1994802 hartree
pointgroup: C01 [X(C10H15N1)]
dipole: 0.55612 0.6961924 -0.1786485 debye
dipolederiv: -0.5472306 -0.028624 0.0164787 0.1365751 -0.2956181 0.0186702 0.0031555 0.0184904 -0.2284846 -0.2227021 -0.0213315 -0.0665321 -0.1493023 0.1661222 -0.0154345 -0.2178085 -0.0217026 0.0325866 0.0336094 0.0152848 0.014672 0.0838522 0.128313 -0.0284902 0.1898939 -0.031342 0.1269348 0.787935 -0.0313488 0.0210291 0.1080651 0.0425353 -0.0322838 -0.0493082 -0.0074869 -0.0315531 0.2631148 -0.0772884 -0.0766072 0.0866015 -0.2381249 0.0282167 -0.0529311 0.0241034 -0.0319432 0.0505556 0.0043853 0.050528 -0.0545426 0.1581886 0.0112149 0.1711908 -0.0038537 0.0607287 -0.3659922 -0.0078473 -0.0131262 -0.2285175 0.0224329 0.0113929 0.0388888 -0.0125151 -0.1131493 0.0624282 0.0063194 0.0028833 0.0665191 0.1516566 -0.02609 -0.0182283 -0.0164488 -0.126602 -0.0761717 -0.0125337 -0.0157482 -0.046536 0.106472 -0.0100018 -0.1105741 -0.0108399 0.054721 0.0476021 0.0622976 -0.003593 -0.2130337 0.3251546 -0.025502 -0.004562 -0.0198597 -0.0901488 -0.0255925 0.0048794 0.0415985 0.0174759 0.0747671 0.0063484 -0.0594085 0.0184055 0.0057755 0.0022788 -0.0257998 0.0535579 -0.0471001 0.0111129 0.1114565 0.0676198 0.0637035 -0.0453416 0.0120528 0.0303863 0.0116052 0.0885916 -0.1380303 -0.091498 0.0070625 -0.0428666 0.0476815 0.0132257 -0.0655034 0.054674 -0.0539525 -0.018967 0.1300936 0.038227 0.0851245 -0.0872051 0.0307825 0.0775556 0.019566 0.0635216 -0.0875217 -0.0768951 0.0223276 -0.037107 0.0534972 -0.0519708 -0.0364956 -0.0411987 -0.0956512 -0.0229075 -0.1187337 -0.0632764 -0.0765336 -0.025339 0.0231888 0.0141075 0.0052345 0.1030307 -0.1104505 0.1033379 -0.0115331 0.0714976 0.0214451 0.0381048 0.0974339 0.013695 0.1016181 -0.0659796 0.0007519 0.007339 0.0005164 0.1455901 0.0018927 -0.1101719 0.0038636 -0.1081623 -0.0271719 0.0160533 0.0106798 0.0175168 0.1288151 0.039518 -0.0259804 0.0356414 -0.0631981 -0.0141644 0.1208378 0.1042333 0.1293547 -0.0511799 0.0222676 0.05104 0.0162986 0.1292775 -0.140663 -0.0552679 0.0542642 -0.060477 0.0792031 -0.0561069 -0.0355673 -0.1016937 -0.0546002 0.0746297 -0.0718527 -0.1466583 -0.0714554 -0.1086522 0.0055761 0.0994191 -0.0057444 0.1181743 -0.0701977 0.0028302 -0.0018646 0.0030583 0.1185855 0.0672061 -0.0928251 -0.0754726 -0.0634196 -0.0245624 -0.1107726 -0.0403564 -0.0647377 -0.0182258 -0.249098 0.0328723 0.0644502 0.031124 0.1041411 0.0006595 0.0757417 -0.0014049 0.0502758 0.093526 0.075336 -0.0260599 0.0435893 -0.111167 0.1009585 -0.0141144 0.0468599 0.0319845 unknown
polarizability: 158.8535254|-1.6697499|105.7675299|-3.6647016|-0.4006493|76.6432626 unknown
InChI: InChI=1S/C10H15N/c1-3-5-10-7-6-9(4-2)8-11-10/h6-8H,3-5H2,1-2H3
charge 0 multiplicity 1
26 atoms
N  -0.328806 -1.052595 0.482415
C  -2.421041 0.233842 0.549982
C  -3.09496 -0.211318 -0.777636
C  -0.907151 0.1918 0.46816
C  1.895317 -0.018816 0.259984
C  3.397521 -0.194296 0.113506
C  -0.120291 1.36749 0.357737
C  1.282834 1.260066 0.252869
C  -4.634259 -0.235328 -0.674602
C  1.027831 -1.135054 0.38162
C  3.871509 -0.046726 -1.357662
H  -2.752609 -0.448871 1.355568
H  -2.759442 1.254521 0.813599
H  -2.782339 0.470339 -1.593817
H  -2.712939 -1.216719 -1.037183
H  3.92545 0.551873 0.738897
H  3.69302 -1.191743 0.491168
H  -0.608012 2.348168 0.360275
H  1.900655 2.163157 0.172843
H  -4.966209 -0.933189 0.117101
H  -5.035749 0.766465 -0.42967
H  -5.094251 -0.560074 -1.625935
H  1.444037 -2.151304 0.406301
H  3.39315 -0.805294 -2.00292
H  4.967353 -0.170243 -1.432695
H  3.60948 0.948949 -1.759507
