program: Gaussian 09
title: 000090267
version: EM64L-G09RevD.01
frameworkgroup: C1[X(C21H25ClN4O3S)]
method: RPBEPBE
basis: SDD
operation: Freq
keyword: #p
keyword: freq=noraman
keyword: PBEPBE/SDD
title: #p freq=noraman PBEPBE/SDD
converged: YES YES NO NO
title: Mulliken charges:
elementType: Cl S O O O N N N N C C C C C C C C C C C C C C C C C C C C C H H H H H H H H H H H H H H H H H H H H H H H H H
charge: -0.048927 0.985097 -0.538905 -0.536425 -0.437746 -0.280754 -0.092465 -0.214022 -0.048803 -0.383588 -0.386612 -0.361330 -0.352691 -0.343684 -0.127682 -0.323548 -0.229708 -0.202247 0.422337 -0.409847 -0.571920 -0.358007 -0.369220 0.053034 0.372278 -0.360138 -0.356161 -0.225431 -0.218086 -0.105745 0.211565 0.253596 0.253501 0.213995 0.217106 0.207128 0.207684 0.208375 0.225661 0.174798 0.188267 0.233908 0.280178 0.279176 0.250197 0.247791 0.255861 0.256852 0.248607 0.279485 0.332898 0.239881 0.268830 0.256781 0.258824
chargesum: 0.00000
title: Mulliken charges with hydrogens summed into heavy atoms:
elementType: Cl S O O O N N N N C C C C C C C C C C C C C C C C C C C C C
charge: -0.048927 0.985097 -0.538905 -0.536425 -0.104847 -0.280754 -0.092465 -0.214022 -0.048803 0.081574 0.080884 0.062905 0.063369 0.056776 -0.127682 0.098627 0.050470 0.076929 0.422337 0.088141 -0.059207 -0.109400 -0.089735 0.053034 0.372278 -0.120258 -0.087331 0.031350 0.040738 -0.105745
polarizability: 6.05990702e+02 -7.14244762e+01 2.58965537e+02 -6.37128924e+00 -3.16898383e+01 2.64183367e+02
1716.lowfreq: -4.4684 -1.2548 -0.0014 0.0009 0.0018 4.2770 9.9450 15.4106 28.2500
frequency: 9.8614 15.3611 28.2475 34.7182 39.1973 46.8744 53.0368 63.6403 67.1191 83.9291 89.7883 107.4025 118.8805 131.7782 138.0306 146.0829 164.7404 183.3871 196.3038 208.9357 236.8755 246.9555 255.0088 269.3141 287.5521 293.3054 307.4977 330.7660 334.8232 351.2553 356.2157 373.0411 382.1202 408.2385 409.2084 417.7989 418.5089 441.6402 463.0077 471.5733 476.7155 477.1849 520.4290 538.5514 541.1705 550.7507 618.6814 624.2151 642.6464 684.9612 705.9648 714.7177 718.0783 772.7756 798.4711 803.7213 814.1518 818.9140 826.1949 835.7057 843.5813 844.1267 848.8259 856.4928 856.5720 926.6958 950.1885 955.0542 957.1791 961.9584 978.1485 979.0378 980.8289 987.4349 994.9295 996.1824 1005.0861 1029.4788 1032.4083 1041.6437 1042.5015 1049.1729 1053.5687 1069.0396 1073.2587 1086.8561 1099.6652 1112.5010 1113.9692 1127.8308 1139.3634 1144.2396 1156.4361 1183.5341 1186.7155 1188.3917 1211.2263 1229.9924 1255.3083 1258.2248 1269.2413 1290.1943 1291.6591 1295.0303 1296.8126 1304.0830 1311.0446 1321.8599 1324.2267 1335.4613 1348.8630 1349.4321 1363.0626 1367.5862 1386.1820 1394.3278 1397.5861 1408.4241 1422.1229 1453.1900 1457.8789 1460.8311 1462.4167 1468.5032 1472.5016 1480.9600 1481.1463 1487.7623 1498.7447 1537.9322 1571.7242 1577.5221 1599.3128 1603.7341 2837.1438 2884.2964 2894.0507 2925.9082 2928.0563 2968.5275 2989.8459 3009.6445 3038.3571 3040.1924 3043.9236 3046.0459 3066.3221 3071.4078 3073.4381 3102.4723 3144.1661 3148.9260 3153.2249 3156.6922 3167.8247 3171.9347 3177.0504 3190.0803 3556.4191
redmass: 7.6562 5.3349 4.5812 3.7952 5.6562 4.2465 3.9663 2.6737 5.8707 3.9991 3.7526 7.8139 5.2466 1.9372 6.1400 5.5993 9.8051 7.7389 5.7590 5.5309 3.5294 4.1239 3.6830 5.6002 2.8171 3.7627 2.2345 1.9176 4.5709 5.0148 5.8302 5.3650 4.2681 2.4547 2.9102 4.9916 3.0260 6.4003 6.2593 6.5780 3.2787 3.6626 3.1452 6.0539 2.8234 5.8962 7.1592 7.1600 2.0995 6.9387 7.1986 3.4860 3.4142 3.3168 1.1921 11.8018 1.3710 1.3666 5.8183 1.3319 1.6956 2.8183 1.4152 3.3378 1.9727 2.7512 1.3559 2.9078 1.7776 3.5398 1.5265 2.5463 1.6516 4.8545 4.3838 2.6078 3.7994 2.2781 2.7329 1.8302 1.6702 2.4429 1.9434 2.1485 2.6859 4.5340 1.9479 3.7274 1.3764 1.4393 2.4844 1.8572 1.1501 1.1372 1.1335 1.0949 2.0986 1.1003 1.3823 1.5338 1.2863 1.1356 1.3747 1.3284 1.2928 1.3568 2.2833 1.2532 1.8232 1.2766 1.3033 1.2810 4.7688 1.3315 5.1736 1.3781 3.4441 3.2915 4.3135 1.0796 1.0800 1.2154 1.0804 1.0861 1.0995 2.2750 1.0921 1.2717 2.5556 7.1272 7.5899 7.8060 6.1126 6.0940 1.0710 1.0700 1.0688 1.0672 1.0653 1.0690 1.0576 1.0611 1.0904 1.1075 1.0873 1.0907 1.1049 1.0927 1.0947 1.0965 1.0886 1.0877 1.0904 1.0884 1.0961 1.0961 1.0977 1.0945 1.0661
irintensity: 0.0639 1.7003 0.1305 0.2115 2.0110 0.8414 2.0125 4.0890 0.9456 6.8290 2.1546 0.7144 2.0146 0.9103 0.8263 0.4329 0.6549 1.8603 3.3768 0.4129 2.2562 1.4279 6.9089 9.7853 20.3094 1.0143 55.3910 49.0333 45.3738 5.4470 1.1691 41.4587 1.8377 3.0625 0.0235 55.2136 0.1105 24.0997 31.0702 110.8174 14.0464 37.6895 29.8989 9.3700 12.4524 55.1562 0.6018 0.2294 17.2092 58.1568 13.5895 1.3692 4.2876 7.1298 6.1048 147.4294 46.1338 9.4153 43.8377 11.5661 76.9562 11.2583 26.9611 4.9435 3.7257 15.2978 0.0142 48.4157 48.8127 94.8517 2.9836 11.6028 6.5174 4.3137 30.6756 48.7469 7.6818 13.8665 1.4506 4.0677 0.0257 95.9839 9.6037 13.4173 97.8229 203.4307 13.4203 18.2461 6.2778 76.9621 17.9372 17.4184 1.8402 33.1657 1.4045 0.8021 3.8751 0.0614 27.7373 61.5018 17.8198 8.8502 19.5323 10.1455 1.4495 20.7237 98.7449 1.0689 2.2987 48.1361 27.4030 0.7874 38.3446 2.3779 19.6571 4.9063 159.7903 86.7696 6.7641 1.6962 3.9991 18.9020 21.2733 55.3564 4.9105 222.3259 16.1850 92.6876 174.0299 58.7008 17.8166 9.4068 185.0428 392.3223 124.9667 61.7301 115.3862 9.7766 85.8585 58.1130 31.6797 28.5018 7.9323 4.5397 46.1103 30.3111 21.4195 8.0083 11.1473 25.7826 10.1437 2.6524 0.3552 1.5704 12.8754 7.3494 1.8843 2.1578 9.3179
temp: 298.150 k
press: 1.00000 atm
elementType: 17 16 8 8 8 7 7 7 7 6 6 6 6 6 6 6 6 6 6 6 6 6 6 6 6 6 6 6 6 6 1 1 1 1 1 1 1 1 1 1 1 1 1 1 1 1 1 1 1 1 1 1 1 1 1
symmnumber: 1
zpe: 1131374.1 jmol-1
zpe.correction: 0.430918 hartree
zpe.thermalcorrener: 0.460313 hartree
zpe.thermalcorrenthalpy: 0.461257 hartree
zpe.thermalcorrgfe: 0.366372 hartree
zpe.sumelectzpe: -2115.588781 hartree
zpe.sumelectthermal: -2115.559386 hartree
zpe.sumelectthermalent: -2115.558441 hartree
zpe.sumelectthermalfe: -2115.653327 hartree
dipole: -3.8992 1.9979 5.2007
dipole: 6.8002
quadrupole: -198.8069 -223.3221 -183.8875
quadrupole: 31.0473 -13.7350 -28.8547
quadrupole: 3.1986 -21.3166 18.1179 31.0473 -13.7350 -28.8547
hfenergy: -2116.0196988 hartree
pointgroup: C01 [X(C21H25Cl1N4O3S1)]
dipole: -1.5697805 0.8780527 1.9805304 debye
polarizability: 606.2659613|-70.4289189|255.738456|2.8317555|-32.5195038|267.1351892 unknown
InChI: InChI=1S/C21H25ClN4O3S/c22-18-3-1-17(2-4-18)21-9-10-26(23-21)19-5-7-20(8-6-19)30(28,29)25-13-11-24(12-14-25)15-16-27/h1-8,27H,9-16H2
charge 0 multiplicity 1
55 atoms
Cl -9.208986 2.129965 -1.597085
S  3.533794 -2.241863 -0.99912
O  4.136177 -3.436112 -0.071242
O  3.489731 -2.300301 -2.624542
O  6.644364 5.388546 0.730575
N  4.614289 -0.742914 -0.606732
N  5.497103 1.787157 0.310527
N  -2.119235 -1.155346 0.939946
N  -3.063424 -0.530067 0.12676
C  4.761668 -0.51988 0.852762
C  4.173194 0.474744 -1.33112
C  5.869734 0.540709 1.025538
C  5.284731 1.527159 -1.135604
C  6.417871 2.915166 0.578051
C  1.78462 -1.898014 -0.400546
C  5.725941 4.284637 0.410571
C  1.429048 -2.293989 0.900759
C  0.873777 -1.278946 -1.280653
C  -0.822952 -1.400583 0.487993
C  -2.656614 -1.52113 2.286621
C  -4.124872 -1.016783 2.210887
C  0.11899 -2.042848 1.348239
C  -0.433436 -1.027057 -0.835569
C  -4.206678 -0.42882 0.797045
C  -5.401285 0.185182 0.217931
C  -6.6041 0.275452 0.974834
C  -5.392056 0.70491 -1.111131
C  -7.764243 0.86468 0.430032
C  -6.542198 1.294036 -1.664917
C  -7.716633 1.36658 -0.884032
H  3.824543 -0.144246 1.323173
H  5.064794 -1.470158 1.324297
H  4.065703 0.226638 -2.400846
H  3.214521 0.882476 -0.937397
H  5.983331 0.767827 2.101365
H  6.83045 0.110289 0.652041
H  4.977064 2.462455 -1.636386
H  6.216004 1.155792 -1.629831
H  6.770165 2.845676 1.623412
H  7.331012 2.877087 -0.073256
H  5.309177 4.403097 -0.61172
H  4.902285 4.378082 1.134614
H  2.153497 -2.816235 1.534344
H  1.178423 -1.032612 -2.303176
H  -2.588842 -2.613658 2.440664
H  -2.073792 -1.019147 3.08047
H  -4.342095 -0.250543 2.976328
H  -4.853591 -1.835806 2.346541
H  -0.168961 -2.354918 2.356289
H  -1.170074 -0.556142 -1.489601
H  7.400683 5.3753 0.090569
H  -6.642915 -0.115322 1.99717
H  -4.47187 0.638113 -1.699098
H  -8.685726 0.93188 1.015186
H  -6.531807 1.690703 -2.684129
