program: Gaussian 09
title: 000090292
version: EM64L-G09RevD.01
frameworkgroup: C1[X(C19H23ClN2O)]
method: RPBEPBE
basis: SDD
operation: Freq
keyword: #p
keyword: freq=noraman
keyword: PBEPBE/SDD
title: #p freq=noraman PBEPBE/SDD
converged: YES YES NO NO
title: Mulliken charges:
elementType: Cl O N N C C C C C C C C C C C C C C C C C C C H H H H H H H H H H H H H H H H H H H H H H H
charge: -0.061332 -0.247180 -0.091121 -0.376004 -0.360779 -0.338525 -0.349359 -0.385202 -0.346232 -0.319873 -0.316219 0.479285 0.472504 -0.460014 -0.348107 -0.426241 -0.367580 -0.204086 -0.214964 -0.222723 -0.242917 -0.112457 -0.243007 0.166971 0.223296 0.205438 0.191102 0.190436 0.212892 0.247288 0.196919 0.202524 0.213613 0.193999 0.194056 0.213679 0.260641 0.236291 0.258609 0.225722 0.266019 0.254067 0.253147 0.223690 0.223848 0.227888
chargesum: 0.00000
title: Mulliken charges with hydrogens summed into heavy atoms:
elementType: Cl O N N C C C C C C C C C C C C C C C C C C C
charge: -0.061332 -0.247180 -0.091121 -0.115363 0.029487 0.058016 0.053969 0.059005 -0.143708 0.087738 0.091515 0.479285 0.472504 -0.223723 -0.089498 -0.200519 -0.101561 0.049981 0.038184 0.000967 -0.019070 -0.112457 -0.015119
polarizability: 2.61346872e+02 -2.94126377e+01 2.18653850e+02 8.87942730e+00 -5.23440591e+00 2.04531509e+02
1716.lowfreq: -20.7622 -7.1876 -4.3789 -0.0002 0.0011 0.0018 4.7873 8.9569 20.5468
frequency: -18.5056 7.0162 20.5096 29.5008 35.4302 50.6572 64.8504 92.3330 111.6891 137.1190 162.8524 185.2355 210.3309 228.1413 234.1394 247.2174 281.5586 316.5437 320.5649 342.8022 371.7840 397.5912 405.5178 407.8593 429.7083 457.3884 469.2163 480.4754 495.2971 555.4596 596.9967 614.4125 616.4458 628.6851 676.4801 692.8933 709.0595 721.4706 756.2663 767.8122 796.1461 808.4308 815.3191 827.4077 839.9888 841.6273 847.7771 861.1366 897.2532 933.8928 947.9096 962.3346 985.8156 990.0189 994.8002 999.6401 1003.8650 1019.2061 1025.8930 1027.0739 1049.6989 1057.9397 1070.6593 1074.6209 1085.3680 1090.2928 1104.8062 1115.9213 1129.4966 1139.4288 1149.9903 1168.3601 1175.6929 1181.1471 1189.9812 1190.9845 1202.6685 1211.9676 1246.8044 1266.7686 1270.3560 1290.2736 1292.1088 1293.1511 1301.0666 1318.8417 1332.2031 1335.2637 1348.0657 1362.7120 1370.5254 1381.2719 1386.4580 1393.6922 1398.8018 1439.4013 1442.2920 1447.4949 1449.7105 1451.5207 1459.0325 1472.0510 1473.7563 1478.4636 1493.8938 1587.7833 1594.7043 1596.5824 1611.3895 2827.5662 2850.0856 2855.3488 2869.2505 2878.8622 2955.5684 2959.4953 3027.9185 3034.8439 3038.0327 3054.7211 3079.9708 3083.1977 3110.2446 3121.8354 3127.1286 3134.6672 3144.9411 3151.1060 3161.4682 3167.7127 3172.3728 3442.9050
redmass: 3.2931 3.8494 5.0768 5.8062 5.0487 4.3587 4.2684 4.8171 4.2490 2.7817 4.0345 5.5607 4.8683 2.7613 2.9955 2.9375 4.4833 3.6186 3.1301 4.1831 3.5528 2.1225 2.8927 2.8834 6.4743 3.4518 2.8874 4.0475 3.8445 3.0643 2.5182 3.0960 5.4122 3.6868 4.5297 2.1985 1.9412 2.7178 2.0060 3.5008 1.5433 3.2598 1.8069 1.2518 1.6453 2.2875 2.9922 1.2635 2.3255 1.4328 1.3805 1.3780 1.4061 5.2179 3.0287 4.1166 1.3195 2.6822 2.0785 2.1892 2.8491 2.0262 2.6660 1.6232 2.4275 3.0651 1.5341 2.2192 3.6623 2.5200 2.0616 1.1026 1.1355 1.1276 1.0757 2.3607 2.0655 1.3605 1.3280 1.4567 1.2876 1.3328 1.2966 1.2498 1.3124 1.4036 1.2780 1.2945 1.3252 1.4846 1.2733 5.7883 5.2969 2.1184 1.6631 2.1484 1.0826 1.0827 1.1208 1.2060 1.1120 1.0897 2.4287 2.2500 1.0822 7.3316 6.2282 6.3404 6.1633 1.0710 1.0818 1.0705 1.0690 1.0710 1.0663 1.0664 1.0895 1.0849 1.0891 1.0908 1.0963 1.0981 1.0876 1.0858 1.0898 1.0907 1.0956 1.0883 1.1013 1.0953 1.0971 1.0746
irintensity: 0.1478 0.0480 0.1650 0.5085 0.0869 0.2887 0.4584 0.1851 0.7100 2.2281 2.8544 1.6918 0.4311 4.1596 2.3008 2.2089 3.8270 5.1556 6.1201 1.0396 2.5124 1.2795 0.5070 0.1981 1.7344 7.4194 0.7583 15.2931 29.1975 12.6204 25.5061 7.5648 1.2484 19.0637 12.8831 17.4417 44.3365 15.9631 83.3277 11.0686 17.9158 3.8879 43.6004 0.8688 1.7697 13.6712 6.1463 0.1167 9.7064 2.5734 0.1874 0.2142 0.0920 0.4111 16.2073 52.7330 5.1258 17.6380 5.3154 10.5764 26.7522 0.8894 35.3861 8.0213 15.7129 49.0189 7.4514 22.7417 56.3698 63.2473 8.7247 2.0226 2.7891 0.6935 2.2911 11.9263 3.4889 1.5369 17.5165 8.8938 5.0572 35.3856 1.3453 1.8803 4.1623 5.6085 1.2360 11.4144 7.0415 2.5783 2.6921 0.5864 2.9262 9.1506 5.3176 14.7615 2.8070 3.7658 43.6942 25.3430 0.4382 9.9067 83.1058 16.2594 3.2449 1.4222 0.5852 9.4254 7.4484 76.5219 49.0800 55.9157 152.0495 107.4093 28.8999 100.3679 27.7712 27.1399 37.7518 34.6384 40.9877 38.5164 9.2027 0.2939 9.2743 11.0078 31.6779 3.4079 31.4815 6.8372 0.9204 0.5521
temp: 298.150 k
press: 1.00000 atm
elementType: 17 8 7 7 6 6 6 6 6 6 6 6 6 6 6 6 6 6 6 6 6 6 6 1 1 1 1 1 1 1 1 1 1 1 1 1 1 1 1 1 1 1 1 1 1 1
symmnumber: 1
zpe: 998759.5 jmol-1
zpe.correction: 0.380407 hartree
zpe.thermalcorrener: 0.401076 hartree
zpe.thermalcorrenthalpy: 0.402021 hartree
zpe.thermalcorrgfe: 0.326707 hartree
zpe.sumelectzpe: -1380.860916 hartree
zpe.sumelectthermal: -1380.840247 hartree
zpe.sumelectthermalent: -1380.839303 hartree
zpe.sumelectthermalfe: -1380.914616 hartree
dipole: -0.6047 0.6509 0.6627
dipole: 1.1084
quadrupole: -180.0204 -143.2379 -129.1616
quadrupole: 0.6372 7.7094 -2.7832
quadrupole: -29.2138 7.5687 21.6450 0.6372 7.7094 -2.7832
hfenergy: -1381.2413231 hartree
pointgroup: C01 [X(C19H23Cl1N2O1)]
dipole: -0.2235847 -0.3016202 -0.221778 debye
polarizability: 260.2634468|29.076844|218.3309137|-11.950535|-6.8960974|205.9378698 unknown
InChI: InChI=1S/C19H23ClN2O/c20-18-8-6-17(7-9-18)19(16-4-2-1-3-5-16)21-10-11-22-12-14-23-15-13-22/h1-9,19,21H,10-15H2
charge 0 multiplicity 1
46 atoms
Cl 6.361439 2.762276 0.246336
O  -6.681397 1.225689 -0.579382
N  -3.8772 0.745594 0.029713
N  -0.082363 0.599223 0.019778
C  -2.479624 1.060514 0.403555
C  -4.295711 1.35563 -1.259686
C  -4.85169 1.097373 1.095737
C  -1.455059 0.212044 -0.375644
C  1.006543 -0.205084 -0.588738
C  -5.710488 0.882031 -1.631461
C  -6.257885 0.622101 0.695851
C  2.339007 0.527475 -0.383458
C  1.050209 -1.627232 0.00408
C  3.155652 0.866302 -1.488596
C  2.770093 0.88345 0.920449
C  1.587336 -2.691287 -0.760642
C  0.599192 -1.887991 1.320745
C  4.384382 1.543717 -1.309363
C  3.989419 1.565203 1.1199
C  1.683691 -3.992193 -0.217818
C  0.689626 -3.188256 1.865151
C  4.779806 1.883088 -0.002689
C  1.235387 -4.245023 1.099674
H  -2.24894 2.15063 0.263833
H  -2.347753 0.844766 1.479703
H  -3.592256 1.054774 -2.05736
H  -4.289131 2.47433 -1.198002
H  -4.880376 2.200861 1.283188
H  -4.550769 0.597885 2.035998
H  -1.611805 -0.851163 -0.124065
H  -1.621371 0.311303 -1.47633
H  0.860904 -0.318182 -1.693083
H  -6.072748 1.386803 -2.542407
H  -5.702651 -0.217998 -1.789696
H  -6.261213 -0.485554 0.604759
H  -7.011632 0.937466 1.436232
H  0.086017 1.605731 -0.111916
H  2.834916 0.603811 -2.50391
H  2.148114 0.622804 1.782409
H  1.936845 -2.501036 -1.783797
H  0.166459 -1.061369 1.895903
H  5.013948 1.80348 -2.165228
H  4.322136 1.838438 2.125568
H  2.102819 -4.806305 -0.820088
H  0.333793 -3.378938 2.884319
H  1.305928 -5.253882 1.521782
