program: Gaussian 09
title: 000007885
version: EM64L-G09RevD.01
frameworkgroup: C1[X(C5H11Cl3Si)]
method: RPBEPBE
basis: SDD
operation: Freq
keyword: #p
keyword: freq=noraman
keyword: PBEPBE/SDD
title: #p freq=noraman PBEPBE/SDD
converged: YES YES NO NO
title: Mulliken charges:
elementType: Cl Cl Cl Si C C C C C H H H H H H H H H H H
charge: -0.241018 -0.242300 -0.241860 0.816182 -0.296441 -0.332550 -0.837754 -0.356289 -0.691084 0.216619 0.216621 0.190839 0.191456 0.283326 0.283479 0.198866 0.198862 0.220932 0.211124 0.210989
chargesum: 0.00000
title: Mulliken charges with hydrogens summed into heavy atoms:
elementType: Cl Cl Cl Si C C C C C
charge: -0.241018 -0.242300 -0.241860 0.816182 0.136799 0.049746 -0.270948 0.041439 -0.048039
polarizability: 1.23862664e+02 1.65376884e-01 9.73482389e+01 -6.49506260e+00 2.19547085e-02 9.71657931e+01
1716.lowfreq: -10.7348 -4.2695 0.0014 0.0024 0.0030 5.1891 33.1876 39.5820 53.8819
frequency: 32.7269 39.4460 53.7887 98.4452 119.3780 123.5789 139.1182 144.8386 173.9411 205.5198 229.3168 252.6428 326.6899 398.9014 436.9710 496.8644 525.9710 730.4335 745.4635 751.9163 819.4208 897.6279 938.7200 993.1175 1047.5910 1062.5712 1073.3655 1105.6590 1196.6954 1230.2275 1257.0274 1287.0870 1292.1120 1302.1663 1344.0206 1354.1420 1391.3126 1405.4121 1466.5488 1470.8668 1477.6761 1480.3882 1488.4335 2959.8849 2971.5711 2974.7636 2981.8499 2995.0280 3000.7287 3023.9457 3042.5708 3063.7860 3071.8498 3075.4364
redmass: 4.0250 1.9681 7.3447 3.0568 1.7825 7.0502 7.6250 5.8434 9.4602 3.3359 1.1206 9.1404 3.8041 5.8611 4.0187 13.7013 17.1163 1.0709 1.1712 5.5114 1.2532 1.7908 1.2401 4.7664 3.3666 1.1373 2.4744 2.1343 1.5927 1.2821 1.2609 1.3114 1.0626 1.1035 1.3643 1.5527 1.2132 1.0791 1.0673 1.0694 1.0424 1.0691 1.0885 1.0589 1.0591 1.0366 1.0594 1.0576 1.0992 1.1025 1.1038 1.1026 1.1010 1.0993
irintensity: 0.4338 0.3198 0.8521 0.0011 0.0256 0.7904 1.5953 6.2601 7.2192 1.9857 0.0030 3.1224 0.7636 35.7432 17.4516 99.9180 135.0226 22.2505 11.2170 38.8412 20.5904 2.5055 4.1227 6.7959 0.9051 15.5366 2.2152 34.8287 0.4596 14.3751 0.9285 2.3644 1.5922 0.1168 2.0749 0.1322 10.8588 8.1905 1.0349 0.4088 12.9973 4.9080 20.8021 6.5501 34.7903 35.1123 34.5429 16.1969 0.5569 5.6949 25.9662 7.2444 93.0478 47.4300
temp: 298.150 k
press: 1.00000 atm
elementType: 17 17 17 14 6 6 6 6 6 1 1 1 1 1 1 1 1 1 1 1
symmnumber: 1
zpe: 404155.7 jmol-1
zpe.correction: 0.153935 hartree
zpe.thermalcorrener: 0.167077 hartree
zpe.thermalcorrenthalpy: 0.168021 hartree
zpe.thermalcorrgfe: 0.111331 hartree
zpe.sumelectzpe: -1866.075079 hartree
zpe.sumelectthermal: -1866.061937 hartree
zpe.sumelectthermalent: -1866.060993 hartree
zpe.sumelectthermalfe: -1866.117683 hartree
dipole: 3.8856 -0.0342 1.2314
dipole: 4.0762
quadrupole: -89.4621 -87.8872 -87.3245
quadrupole: -0.0017 0.2426 -0.0063
quadrupole: -1.2375 0.3374 0.9001 -0.0017 0.2426 -0.0063
hfenergy: -1866.229014 hartree
pointgroup: C01 [X(C5H11Cl3Si1)]
dipole: -1.5341848 -0.4665501 -0.0224598 debye
dipolederiv: -0.7232916 0.2338838 0.0155994 0.3213781 -0.5978953 -0.018955 0.0225458 -0.0191855 -0.3133875 -0.4004452 -0.0288449 0.0235909 -0.0998187 -0.5057813 0.2351061 0.0827551 0.2422877 -0.6218961 -0.4009274 -0.0286591 -0.030779 -0.0929103 -0.4496227 -0.2138833 -0.0990768 -0.2213424 -0.6774824 1.6332615 -0.1906374 -0.0092603 -0.1365147 1.6959979 -0.0027263 -0.0061019 -0.0031909 1.7741683 -0.0971016 0.0049378 0.0006219 -0.3045537 0.0800343 -0.0016681 -0.0148765 -0.0017179 0.1311181 -0.0498732 0.0285838 0.0010406 0.2006837 0.0696798 -0.004908 0.0068537 -0.0045718 0.1907368 -0.249674 0.0921072 0.0044606 0.1485642 -0.2897091 -0.0017288 0.0080213 0.0008085 -0.2781595 0.0088609 -0.0098241 -0.0002944 -0.1257597 0.1019899 -0.0020903 -0.0042719 -0.0020978 0.1699277 -0.0889819 -0.0253573 -0.000877 0.0479298 0.0559466 -0.0013437 0.0010221 -0.0013463 0.0974141 0.0749156 -0.0020118 -0.0160143 0.0075573 0.0012213 -0.0884579 -0.0085887 -0.1047019 -0.0550658 0.0750999 -0.0026766 0.0151781 0.0077705 -0.0157165 0.0918418 0.0085889 0.1075581 -0.037928 0.0398703 0.0022423 -0.0000068 -0.0105484 -0.0298487 -0.1068842 -0.0072919 -0.1312479 -0.0898948 0.0393304 0.0011708 0.0006302 -0.0123114 -0.0471726 0.1099158 0.0076343 0.1343666 -0.0721739 0.0437473 -0.0466214 -0.0703392 0.0151843 0.0278781 -0.0861946 0.0317302 -0.0774186 0.0017533 0.0445307 -0.0536994 0.0652208 0.0177856 0.0116828 0.0877631 -0.030148 0.0775591 0.0177645 0.0253634 -0.0337125 0.0410329 -0.0035007 -0.0436832 0.1141997 0.0206895 0.1452017 -0.074348 0.0256843 -0.0305453 -0.0428872 -0.0017404 -0.0267849 -0.1110454 -0.0204714 -0.142177 -0.091573 -0.1505085 0.1092519 0.0028367 0.1426659 -0.0216306 -0.0032755 0.0037187 -0.0034275 0.1015229 0.0748548 -0.0098777 -0.0098878 -0.0625186 -0.0159008 0.1234792 0.0395293 0.1348632 -0.0784455 0.0752844 -0.00971 0.0101337 -0.0593427 -0.0006851 -0.1191446 -0.0422619 -0.1302192 -0.0940512 unknown
polarizability: 123.7101427|-6.7948957|97.3162644|-0.3024311|0.0100039|97.3502884 unknown
InChI: InChI=1S/C5H11Cl3Si/c1-2-3-4-5-9(6,7)8/h2-5H2,1H3
charge 0 multiplicity 1
20 atoms
Cl 3.663174 -1.578763 -0.10357
Cl 2.395052 1.31593 -1.685401
Cl 2.417317 1.099704 1.836669
Si 2.124461 -0.039483 0.000884
C  -0.76285 0.212477 0.011205
C  -2.141225 -0.489514 -0.017504
C  0.400842 -0.8096 -0.036214
C  -3.319068 0.511441 0.014688
C  -4.695949 -0.18625 -0.009861
H  -0.685843 0.829743 0.928434
H  -0.688501 0.907568 -0.848736
H  -2.218214 -1.116612 -0.92991
H  -2.222655 -1.180431 0.847108
H  0.341851 -1.422917 -0.956812
H  0.341378 -1.507689 0.821875
H  -3.236728 1.200015 -0.850554
H  -3.238832 1.141408 0.923655
H  -5.519685 0.550278 0.010002
H  -4.819511 -0.854028 0.863368
H  -4.814712 -0.800475 -0.922226
