program: Gaussian 09
title: 000090218
version: EM64L-G09RevD.01
frameworkgroup: C1[X(C15H14O4)]
method: RPBEPBE
basis: SDD
operation: Freq
keyword: #pfreq=noraman
keyword: PBEPBE/SDD
title: #p freq=noraman PBEPBE/SDD
converged: YES YES NO NO
title: Mulliken charges:
elementType: O O O O C C C C C C C C C C C C C C C H H H H H H H H H H H H H H
charge: -0.287482 -0.269232 -0.242197 -0.192757 -0.270981 -0.228542 0.398904 0.483806 0.174773 -0.579409 0.398430 -0.811848 -0.516752 0.192751 -0.710709 -0.266503 -0.311765 0.118815 -0.511837 0.271176 0.225195 0.239739 0.230725 0.228212 0.237766 0.291848 0.225642 0.251884 0.246679 0.253648 0.235061 0.257109 0.237851
chargesum: 0.00000
title: Mulliken charges with hydrogens summed into heavy atoms:
elementType: O O O O C C C C C C C C C C C C C C C
charge: -0.287482 -0.269232 -0.242197 -0.192757 0.000195 -0.003347 0.398904 0.483806 0.174773 -0.339670 0.398430 -0.115145 -0.224904 0.192751 -0.233183 -0.019823 -0.058118 0.118815 0.218184
polarizability: 3.00585980e+02 -3.54322865e+01 1.89492624e+02 1.29553674e+00 -6.08000886e+00 8.82038960e+01
1716.lowfreq: -3.9106 -2.8668 -0.0008 -0.0006 -0.0003 4.5059 27.9473 40.1364 45.1725
frequency: 27.8748 40.1354 45.1712 63.7019 93.4798 108.4581 122.4535 156.8016 175.1897 180.5943 193.5079 224.1625 243.4355 251.3386 295.3118 310.4567 360.5765 366.4092 391.8820 419.7265 453.9495 468.4620 485.8800 513.5708 519.6574 570.5355 597.6896 636.1594 657.4267 689.2880 716.1997 719.5851 737.9183 755.6143 765.5782 819.1921 826.8704 842.6626 861.1684 879.2936 884.9969 908.8422 948.0695 961.6407 963.8728 984.9207 996.7265 1036.4512 1048.2031 1079.3756 1094.5374 1101.8052 1108.0015 1142.3853 1153.1914 1185.3651 1220.8856 1228.8925 1245.6962 1258.9198 1289.9800 1310.8462 1361.9250 1385.4971 1393.8217 1406.3779 1414.6200 1431.1400 1444.9798 1458.5747 1464.5810 1472.6500 1476.8266 1492.9760 1538.6032 1597.4434 1631.0675 1671.6306 1690.8497 2965.6211 3001.2649 3037.4922 3060.4489 3081.6060 3094.4176 3102.1586 3110.8836 3129.6700 3132.7100 3136.5894 3187.7835 3190.1246 3211.8840
redmass: 3.9105 3.5939 4.4792 3.4002 6.2279 4.5810 6.4359 3.2952 1.1148 1.3166 2.9519 5.4508 6.3276 3.7403 4.9060 4.5755 3.3820 5.5116 5.3305 4.3532 3.3945 6.0622 4.8182 4.0300 3.1498 5.1280 6.9480 4.8419 3.5199 6.0635 2.1522 3.1909 5.9683 3.1416 3.4428 6.0281 1.5570 4.3860 4.7654 3.2109 1.7010 1.5618 4.8183 1.3503 1.9044 1.3263 1.3587 3.1779 1.4552 1.4379 1.3307 1.4942 2.1543 2.0304 1.5519 1.6854 1.7900 1.6807 1.5902 1.5559 1.9088 1.9616 3.4895 3.6338 1.2090 2.7926 1.3133 3.2373 1.3250 1.0888 1.0492 1.0620 1.0725 3.3163 10.1938 6.9257 7.5475 5.4545 10.8267 1.0381 1.0288 1.0970 1.0881 1.0875 1.0974 1.0620 1.1047 1.1058 1.0908 1.0908 1.0954 1.0926 1.1150
irintensity: 2.6785 4.0117 0.6362 5.3476 3.9221 3.4017 1.6754 0.9798 0.5572 0.0258 1.0549 0.6208 3.5334 1.7361 7.5771 2.6795 2.0277 3.1362 4.2753 3.4868 2.8579 3.1227 10.3915 27.2030 4.6648 25.1687 13.5907 1.1397 9.3985 18.3038 6.7507 21.0943 1.7814 29.3384 12.9672 15.9077 37.5945 34.1561 6.5624 10.1475 22.4216 33.9168 28.4134 70.5460 18.0505 0.5519 3.6595 63.4930 2.7769 43.1203 6.1624 35.5949 113.3663 18.7864 4.6204 63.4653 46.1321 28.6357 11.1533 11.9659 135.4329 14.1723 69.0604 59.3748 19.6426 6.9321 1.9384 1.3069 2.8116 28.1962 17.3359 22.6797 20.1485 35.6165 80.2819 20.0251 477.5082 19.0143 510.3474 21.2465 60.4972 21.9432 17.7662 14.6923 29.9333 4.2560 31.7736 19.7251 6.0648 12.8497 1.7796 0.6327 10.9475
temp: 298.150 k
press: 1.00000 atm
elementType: 8 8 8 8 6 6 6 6 6 6 6 6 6 6 6 6 6 6 6 1 1 1 1 1 1 1 1 1 1 1 1 1 1
symmnumber: 1
zpe: 661039.6 jmol-1
zpe.correction: 0.251777 hartree
zpe.thermalcorrener: 0.269621 hartree
zpe.thermalcorrenthalpy: 0.270565 hartree
zpe.thermalcorrgfe: 0.204840 hartree
zpe.sumelectzpe: -879.446792 hartree
zpe.sumelectthermal: -879.428948 hartree
zpe.sumelectthermalent: -879.428004 hartree
zpe.sumelectthermalfe: -879.493729 hartree
dipole: -6.2384 -3.0102 -0.2637
dipole: 6.9318
quadrupole: -142.4963 -95.1838 -114.3949
quadrupole: -4.1744 6.6445 0.4973
quadrupole: -25.1380 22.1745 2.9635 -4.1744 6.6445 0.4973
hfenergy: -879.6985689 hartree
pointgroup: C01 [X(C15H14O4)]
dipole: -2.4713599 1.1472445 0.1167707 debye
polarizability: 299.043972|36.8188428|189.8425824|-8.957931|-12.1781536|89.3959448 unknown
InChI: InChI=1S/C15H14O4/c1-8(2)14-15(19-14)10-6-9-4-5-13(16)18-11(9)7-12(10)17-3/h4-7,14-15H,1H2,2-3H3
charge 0 multiplicity 1
33 atoms
O  -2.935513 -0.764437 -0.759555
O  -0.375168 -2.880693 0.752526
O  3.689262 -0.497308 0.235641
O  5.74335 0.535461 0.004447
C  -2.039182 -0.336104 0.405454
C  -2.894247 0.672264 -0.321769
C  -0.553475 -0.415954 0.247217
C  -4.128759 1.260218 0.300688
C  0.182704 -1.634689 0.46941
C  0.183702 0.759733 0.001005
C  1.601902 0.784132 -0.022569
C  -3.993495 2.708095 0.736219
C  1.596069 -1.633165 0.470277
C  2.294028 -0.440429 0.230839
C  -5.26425 0.528382 0.436676
C  2.389053 1.9705 -0.267067
C  3.766902 1.926641 -0.265428
C  4.509504 0.692427 -0.017641
C  -1.655478 -3.311207 0.143352
H  -2.443743 -0.695267 1.362686
H  -2.384486 1.318822 -1.05374
H  -0.353476 1.70339 -0.148191
H  -3.182596 2.832704 1.480688
H  -3.746454 3.362682 -0.122952
H  -4.929256 3.078802 1.186347
H  2.134597 -2.567169 0.644979
H  -6.166829 0.951451 0.890809
H  -5.305184 -0.506453 0.080469
H  1.872953 2.918922 -0.458276
H  4.377733 2.813751 -0.449495
H  -2.511846 -3.007437 0.767359
H  -1.774476 -2.898208 -0.871564
H  -1.587845 -4.409357 0.112458
