program: Gaussian 09
title: 000090115
version: EM64L-G09RevD.01
frameworkgroup: C1[X(C9H13NO)]
method: RPBEPBE
basis: SDD
operation: Freq
keyword: #p
keyword: freq=noraman
keyword: PBEPBE/SDD
title: #p freq=noraman PBEPBE/SDD
converged: YES YES NO NO
title: Mulliken charges:
elementType: O N C C C C C C C C C H H H H H H H H H H H H H
charge: -0.444614 -0.441280 -0.035976 0.545171 -0.723983 -0.676021 -0.616179 -0.423671 0.342350 -0.180726 -0.403049 0.210229 0.281518 0.223179 0.202500 0.235066 0.245544 0.207830 0.205843 0.204076 0.229842 0.217906 0.247779 0.346666
chargesum: 0.00000
title: Mulliken charges with hydrogens summed into heavy atoms:
elementType: O N C C C C C C C C C
charge: -0.097948 -0.159762 0.174253 0.545171 -0.063237 -0.016804 -0.412103 -0.193829 0.342350 0.037180 -0.155270
polarizability: 1.55918747e+02 -2.35350406e+00 1.11197557e+02 -1.62364826e+00 -5.78023806e+00 6.36916549e+01
1716.lowfreq: -6.0969 0.0007 0.0007 0.0010 3.6452 11.3384 53.8529 78.5134 135.7100
frequency: 53.6802 78.3982 135.7045 205.7107 215.2912 226.2596 249.6358 272.6824 328.4466 339.4911 359.0769 395.7203 428.5614 447.0534 482.1741 512.9360 606.3133 616.8919 677.0542 752.2993 758.8032 810.9473 828.3543 842.8590 910.2522 920.8063 945.7588 954.3868 972.5993 1005.7304 1079.5973 1133.3321 1138.7414 1158.2901 1173.0010 1185.3621 1209.1704 1299.4295 1317.7493 1332.5292 1345.9965 1377.2888 1380.9585 1395.9690 1429.3441 1465.6688 1467.6416 1477.1458 1486.7225 1503.0649 1510.6855 1605.4738 1626.4665 2973.2449 2976.2028 2979.2553 3068.0934 3077.1222 3085.9351 3092.4934 3093.9152 3131.2804 3163.0926 3182.0860 3553.1713 3579.8718
redmass: 4.0134 2.8708 3.2780 4.2689 1.0464 3.3714 1.1192 3.4294 1.8674 1.1478 1.4702 2.9695 2.8058 2.8984 2.7063 7.5116 4.4151 5.3185 1.8109 5.4569 1.3058 2.2064 2.5317 1.4814 2.4140 1.2674 1.4557 1.3098 5.2247 1.9765 1.6066 2.1458 1.5260 1.9282 1.1509 1.7117 1.8345 1.5191 1.3804 1.3681 1.9997 1.2144 3.2380 1.2315 2.7400 1.0606 1.0481 1.1068 1.0525 1.9052 2.7772 5.5007 6.6199 1.0624 1.0488 1.0451 1.0982 1.0991 1.1000 1.0907 1.0997 1.0872 1.0929 1.0965 1.0764 1.0659
irintensity: 0.7918 1.0656 0.4523 0.1557 0.1936 0.3206 0.1215 0.0131 34.3098 128.8752 70.4764 13.2806 12.3095 17.1175 14.3842 3.3407 0.6987 3.3325 32.5986 2.6364 19.5917 85.4207 6.7992 1.1416 9.4506 8.6106 4.3270 1.0641 2.7124 0.6427 27.8636 12.8499 253.8980 4.1880 6.1732 57.6110 73.4654 8.3309 12.9980 12.0111 17.3147 23.6694 83.2746 29.3575 24.1483 6.5749 2.0553 14.4356 12.6842 15.5102 126.3672 98.5908 343.1174 21.3126 20.7061 36.5556 11.3197 67.9953 26.5558 21.3540 41.0496 15.7301 20.0301 5.1380 21.3416 25.3417
temp: 298.150 k
press: 1.00000 atm
elementType: 8 7 6 6 6 6 6 6 6 6 6 1 1 1 1 1 1 1 1 1 1 1 1 1
symmnumber: 1
zpe: 528685.2 jmol-1
zpe.correction: 0.201366 hartree
zpe.thermalcorrener: 0.212794 hartree
zpe.thermalcorrenthalpy: 0.213738 hartree
zpe.thermalcorrgfe: 0.164602 hartree
zpe.sumelectzpe: -479.892759 hartree
zpe.sumelectthermal: -479.881330 hartree
zpe.sumelectthermalent: -479.880386 hartree
zpe.sumelectthermalfe: -479.929522 hartree
dipole: 3.4479 -1.8486 0.2845
dipole: 3.9225
quadrupole: -68.9083 -55.5836 -71.2121
quadrupole: 1.6332 -0.7529 -2.8256
quadrupole: -3.6736 9.6511 -5.9774 1.6332 -0.7529 -2.8256
hfenergy: -480.0941246 hartree
pointgroup: C01 [X(C9H13N1O1)]
dipole: 1.3629023 -0.714681 0.1152723 debye
dipolederiv: -0.9703619 -0.6040369 0.1144932 -0.7143758 -0.587905 0.0499281 0.1420942 0.0506119 -0.445125 -1.6626957 0.1946732 -0.0605187 0.4656474 -0.3313248 -0.1360654 0.0840717 -0.1754566 -0.4985162 0.85033 0.0977647 0.0560454 0.4177176 0.2517925 0.0761051 -0.0694706 0.1030427 0.380964 1.5626085 -0.2926971 0.0357886 -0.7717615 0.3259119 -0.0170608 0.0488892 -0.0069771 0.1667646 -0.1046667 0.0354577 0.0222966 0.0082304 0.0382951 -0.0672635 0.0278756 -0.0743255 0.0515695 -0.1078485 0.0430889 -0.0110604 -0.0901905 0.0067302 -0.1051842 -0.0382943 -0.1455655 -0.1062231 -0.8045586 -0.00682 -0.0002187 -0.1307094 -0.0416597 -0.0410857 0.0341787 -0.0400971 -0.3088702 -0.4222423 -0.0057774 0.0135072 0.5790857 -0.2361958 -0.0053511 -0.1034751 -0.0088545 -0.2883936 1.0382514 0.3705814 -0.0905481 0.5930743 0.8219516 -0.141193 -0.1410597 -0.1306649 0.1430405 0.5446945 0.0881602 -0.0371697 -0.0005156 0.1838395 -0.0554526 -0.0311278 -0.0488441 -0.10256 -0.3170669 -0.0459852 0.0023685 -0.3211167 -0.4235785 0.0435048 0.0558678 0.0296826 -0.2672155 0.0051815 0.0396984 -0.0521293 -0.0653 -0.0606208 0.0992372 -0.0100223 0.0733245 -0.0852996 0.1069164 -0.0109728 -0.0077397 -0.0700476 0.0965635 0.0459612 -0.0158081 0.0905744 0.2852177 -0.1432798 -0.0650139 0.0236436 -0.1207387 0.0243429 0.0175242 0.0039747 0.0045649 0.1065838 0.0896504 -0.0047206 0.0192904 0.0642111 -0.0536205 0.097886 -0.0278291 0.1501387 -0.0473082 0.1053281 -0.0224022 -0.0581078 0.0096706 0.0231396 -0.1087085 -0.0235794 -0.108206 -0.1058339 0.0001453 0.1136819 0.0821495 0.1154287 0.0059036 -0.0575407 0.0879528 -0.0343907 0.0555647 -0.1345055 -0.1310727 0.0004159 -0.1821171 0.0105318 -0.0006158 0.0016685 0.0344064 0.0624165 0.0758196 0.0083961 -0.0472441 0.0678229 -0.0404252 0.1416961 -0.0472353 0.074088 -0.0404973 0.043204 0.0283164 0.0020157 0.0099815 -0.1388169 0.0509968 0.0084167 0.050654 0.1761144 -0.0565143 -0.1003123 0.0207086 -0.1133028 0.0243593 0.0185717 0.0342184 0.0236739 0.1670267 0.0823621 0.0252557 -0.0027775 0.04689 -0.1251483 0.0449559 -0.0045424 0.0422711 0.1397549 -0.0622963 0.0561993 0.0007151 0.0508242 0.0799165 0.0156717 0.0042426 0.0155412 0.1889594 0.2815448 0.188537 -0.0259242 0.1515912 0.1460175 0.0334823 -0.0210068 0.0308078 0.3718659 unknown
polarizability: 155.9657062|-1.9242156|111.1578008|-1.3430779|-5.7996327|63.6844522 unknown
InChI: InChI=1S/C9H13NO/c1-7(2)10-8-4-3-5-9(11)6-8/h3-7,10-11H,1-2H3
charge 0 multiplicity 1
24 atoms
O  -3.472203 -1.302607 0.26931
N  1.383179 -0.712395 -0.067446
C  2.639127 0.051054 -0.174504
C  0.099501 -0.16023 -0.076573
C  3.769275 -0.904643 -0.60967
C  2.996026 0.783714 1.14597
C  -1.027554 -1.016541 0.115081
C  -0.131861 1.232023 -0.291222
C  -2.334711 -0.488817 0.084852
C  -1.453546 1.727843 -0.320832
C  -2.570617 0.888578 -0.134519
H  2.506321 0.809126 -0.973201
H  1.468396 -1.706366 0.14692
H  4.722765 -0.356893 -0.705857
H  3.91925 -1.703849 0.142953
H  3.538425 -1.376996 -1.581061
H  2.152497 1.406745 1.490903
H  3.877958 1.436821 1.007843
H  3.227537 0.051459 1.941616
H  -0.868872 -2.092218 0.280851
H  0.705324 1.920446 -0.435525
H  -1.614198 2.798865 -0.490042
H  -3.596184 1.265362 -0.15182
H  -3.207136 -2.24438 0.416074
