program: Gaussian 09
title: 000090085
version: EM64L-G09RevD.01
frameworkgroup: C1[X(C7H4F5NO2S)]
method: RPBEPBE
basis: SDD
operation: Freq
keyword: #p
keyword: freq=noraman
keyword: PBEPBE/SDD
title: #p freq=noraman PBEPBE/SDD
converged: YES YES NO NO
title: Mulliken charges:
elementType: S F F F F F O O N C C C C C C C H H H H
charge: 0.958270 -0.141338 -0.109702 -0.110766 -0.187253 -0.180271 -0.486840 -0.494994 -0.526516 0.182162 0.321736 0.265402 -0.210329 -0.473051 -0.373099 0.381808 0.319478 0.296873 0.294207 0.274223
chargesum: 0.00000
title: Mulliken charges with hydrogens summed into heavy atoms:
elementType: S F F F F F O O N C C C C C C C
charge: 0.958270 -0.141338 -0.109702 -0.110766 -0.187253 -0.180271 -0.486840 -0.494994 -0.207038 0.182162 0.321736 0.265402 0.086544 -0.178844 -0.098876 0.381808
polarizability: 2.19433439e+02 8.68821732e+00 1.11761528e+02 -1.47357844e+01 8.47085969e+00 9.53555902e+01
1716.lowfreq: -5.8601 -3.8969 -0.0012 0.0009 0.0022 9.1052 10.5250 19.6333 39.1788
frequency: 9.4143 19.5676 39.1708 64.2000 90.1685 126.7918 131.6414 155.3569 170.4208 193.7387 211.2754 219.1103 252.8055 300.9400 338.5908 377.5200 388.9043 411.5166 442.1927 447.1560 456.3570 478.1176 485.6971 552.6483 598.2912 625.4948 700.4525 706.6929 782.8690 805.5089 821.3702 851.2006 853.0034 915.4803 935.9110 945.4939 982.0770 1056.5404 1073.2780 1091.3953 1132.2752 1182.0208 1242.5469 1259.7473 1292.2781 1391.3678 1432.5610 1472.2311 1574.9210 1609.3472 3180.4102 3195.0596 3197.7527 3376.4769
redmass: 17.3979 12.6266 9.5526 13.8243 8.5137 13.7893 16.0460 13.6746 13.3518 15.0559 10.0086 7.6680 15.3209 10.0343 5.6288 9.8394 9.3746 11.0764 4.7183 9.8886 16.2164 6.0572 6.3658 4.8805 4.2142 16.8063 8.0706 3.4004 4.6592 1.5650 2.5413 2.5236 1.5483 13.5614 4.4560 1.3699 11.7661 9.7737 2.2738 12.8097 1.6127 1.5893 2.0435 2.2591 2.1202 4.1740 4.7741 3.0947 7.9200 7.2139 1.0898 1.0947 1.0977 1.0756
irintensity: 0.1006 0.1088 0.5957 0.6350 10.4342 7.1404 5.5215 3.7544 6.5979 2.0706 4.3107 0.6340 1.7326 15.4013 10.6267 44.9928 31.5334 54.7158 21.1030 3.6925 21.6749 8.3060 2.4107 14.2888 4.8704 18.3600 4.2601 1.7280 20.0247 25.6253 37.8031 143.8440 51.7214 337.4297 52.9679 2.8208 48.4653 172.9023 46.8979 206.3837 16.3423 27.4443 5.5459 49.8168 71.5063 7.2189 21.0875 76.8855 40.8749 193.3366 0.4366 4.2808 0.7091 37.8741
temp: 298.150 k
press: 1.00000 atm
elementType: 16 9 9 9 9 9 8 8 7 6 6 6 6 6 6 6 1 1 1 1
symmnumber: 1
zpe: 279013.2 jmol-1
zpe.correction: 0.106270 hartree
zpe.thermalcorrener: 0.122540 hartree
zpe.thermalcorrenthalpy: 0.123484 hartree
zpe.thermalcorrgfe: 0.058922 hartree
zpe.sumelectzpe: -1370.221744 hartree
zpe.sumelectthermal: -1370.205475 hartree
zpe.sumelectthermalent: -1370.204530 hartree
zpe.sumelectthermalfe: -1370.269092 hartree
dipole: -3.5313 -1.4386 -0.3074
dipole: 3.8254
quadrupole: -106.0397 -98.4324 -99.5404
quadrupole: -6.6877 3.2797 1.8812
quadrupole: -4.7022 2.9051 1.7971 -6.6877 3.2797 1.8812
hfenergy: -1370.3280141 hartree
pointgroup: C01 [X(C7H4F5N1O2S1)]
dipole: -1.3445329 0.666809 0.1128995 debye
dipolederiv: 1.1669927 -0.046557 -0.0170912 -0.5435101 1.2347063 -0.0097665 -0.0730777 -0.0463442 1.1749389 -0.2772124 0.2257111 0.0415212 -0.1362045 -0.846586 0.0998685 0.12063 -0.039943 -0.3214149 -1.1417412 -0.3108114 0.21004 -0.5843629 -0.4304083 0.2039465 0.2489297 0.1163528 -0.3279712 -0.1885156 -0.0208758 -0.151366 -0.2357869 -0.3187257 0.1147624 0.3813902 0.1324987 -1.0409013 -0.2048062 -0.2539931 -0.2057391 -0.0263742 -0.6348021 -0.3189916 -0.0488808 -0.3020005 -0.3376354 -1.2438504 0.1615519 -0.3060468 0.2069287 -0.2275685 0.0400548 -0.5016896 0.0508941 -0.2868215 -0.8724558 0.143538 -0.0956136 0.1832148 -0.4738399 0.0065309 -0.1591387 0.0998413 -0.5148158 -0.4795756 -0.0402132 -0.0345485 0.2124667 -0.6177441 -0.0347655 0.1626561 -0.1289172 -0.454409 0.6096248 -0.1044231 -0.163701 0.3283287 -0.2967754 0.0678227 -0.1259582 0.0984638 -0.4828653 -0.2553065 0.051523 0.2167365 0.0306317 -0.1425166 -0.1440245 -0.2115133 -0.0468622 -0.0100255 1.2848346 0.1076942 -0.0668036 0.8536517 1.4496898 -0.3356577 -0.4142756 -0.1821747 1.5134247 0.4757166 0.2108833 0.2122233 -0.3255892 0.7767142 0.4110878 0.2407933 0.300139 0.3898432 0.3387546 -0.0935765 0.0713519 0.1660567 0.0189193 -0.0231353 0.1887266 0.0418989 -0.05205 -0.4676817 -0.0907208 -0.1002931 -0.2370475 -0.1329449 -0.0518117 -0.2410629 -0.0435822 -0.2098262 -0.4300118 0.1205314 0.0189992 0.4845389 -0.1607653 0.0878178 -0.0314104 0.0691043 -0.1004863 1.3461937 -0.1721812 0.4067437 -0.3031831 0.4672492 0.0228259 0.5476939 0.0251774 0.341975 0.0587304 0.0302004 0.0575593 -0.1043678 0.1276257 -0.0522933 0.0349652 -0.0434266 0.2850994 0.0909162 0.0669401 -0.015835 0.0262415 0.0764949 -0.0081869 -0.0014226 -0.0185311 0.1177812 0.1159786 0.0348885 -0.0275802 0.0369227 0.070293 -0.0234888 -0.0505155 -0.028737 0.1749229 0.0734152 -0.02011 -0.0505569 -0.0325559 0.0609844 -0.0525955 -0.0668397 -0.0538516 0.141237 unknown
polarizability: 219.1399166|-13.7333882|114.8160505|10.8528206|5.9817925|92.59459 unknown
InChI: InChI=1S/C7H4F5NO2S/c8-4-1-2-6(5(9)3-4)13-16(14,15)7(10,11)12/h1-3,13H
charge 0 multiplicity 1
20 atoms
S  2.037048 -1.071938 0.321079
F  1.700997 1.702196 -0.461655
F  3.786681 0.920806 -0.933495
F  2.026622 0.329699 -2.251467
F  -0.677197 1.931906 1.560827
F  -4.483944 0.30594 -0.909068
O  3.32184 -1.240673 1.279815
O  1.523211 -2.23395 -0.675132
N  0.496695 -0.636096 1.504339
C  -0.727132 -0.382919 0.859221
C  2.435407 0.615081 -0.957816
C  -1.355156 0.897788 0.895275
C  -1.41457 -1.435525 0.183795
C  -2.608961 1.155339 0.336675
C  -2.662396 -1.206582 -0.421778
C  -3.232417 0.079669 -0.326414
H  0.839359 0.150076 2.090306
H  -0.946409 -2.422098 0.145624
H  -3.07598 2.140855 0.399623
H  -3.195896 -2.002173 -0.947455
