program: Gaussian 09
title: 000090084
version: EM64L-G09RevD.01
frameworkgroup: C1[X(C8H5F6NO2S)]
method: RPBEPBE
basis: SDD
operation: Freq
keyword: #p
keyword: freq=noraman
keyword: PBEPBE/SDD
title: #p freq=noraman PBEPBE/SDD
converged: YES YES NO NO
title: Mulliken charges:
elementType: S F F F F F F O O N C C C C C C C C H H H H H
charge: 0.980494 -0.144470 -0.106362 -0.110275 -0.160462 -0.159920 -0.163978 -0.487198 -0.485837 -0.593177 0.433198 -0.499789 0.334693 -0.313260 0.326457 -0.337269 -0.188253 0.266958 0.322082 0.271873 0.293412 0.271064 0.250021
chargesum: 0.00000
title: Mulliken charges with hydrogens summed into heavy atoms:
elementType: S F F F F F F O O N C C C C C C C C
charge: 0.980494 -0.144470 -0.106362 -0.110275 -0.160462 -0.159920 -0.163978 -0.487198 -0.485837 -0.271096 0.433198 -0.227916 0.334693 -0.019848 0.326457 -0.066206 0.061767 0.266958
polarizability: 2.09313240e+02 -1.01850217e+01 1.23803329e+02 -1.82899348e+01 1.56601814e+01 1.06781240e+02
1716.lowfreq: -10.8031 -6.8911 -3.7084 -0.0012 -0.0011 0.0010 9.9657 13.5069 17.3681
frequency: 9.7416 13.1313 17.2889 26.6898 79.7694 95.6418 122.9702 125.4757 142.7823 158.8165 174.3327 195.4093 215.9565 248.5019 292.1798 307.1647 311.4350 343.7134 386.8754 410.9634 418.9594 434.1031 447.0167 455.1086 480.0283 523.1076 555.6596 607.5647 625.7091 627.6516 686.2729 698.8529 765.0009 813.6928 841.5762 871.7369 902.6602 923.0365 927.5470 984.2487 985.9419 992.2502 995.1584 1016.3341 1051.8689 1057.9370 1091.7857 1106.8554 1188.2177 1207.2526 1255.3693 1295.1056 1324.6008 1396.8646 1439.6360 1481.6988 1588.4875 1606.4337 3154.7714 3156.8866 3173.9242 3188.9012 3411.4010
redmass: 17.6566 13.3224 10.7612 15.1980 9.5120 7.5804 8.6448 15.8174 9.1501 14.4054 11.3314 11.0175 9.5659 9.9666 6.6963 7.2121 8.1309 8.4252 11.9676 20.6796 3.8079 4.0456 17.3040 13.4286 5.1800 7.7572 7.3447 10.9085 9.9696 8.8641 2.0318 7.7514 1.7157 1.6279 6.5409 6.1506 1.5885 10.2167 1.4304 5.9450 7.4810 8.3774 1.5582 5.6170 3.7717 11.1732 13.2684 1.7659 1.1514 2.0261 1.3620 5.2983 1.2620 6.5797 2.8419 2.4997 5.9276 6.0819 1.0923 1.0883 1.0943 1.0985 1.0765
irintensity: 0.0336 0.8192 0.6542 0.3654 6.3857 1.6269 0.2899 1.7822 9.2660 3.1169 2.5467 3.9256 0.8736 5.8050 2.9452 4.4899 19.4809 6.1609 31.3309 104.8494 7.6998 9.2762 5.0193 30.2173 5.4008 2.6237 5.1116 14.9317 7.4045 10.8897 20.3348 3.4828 47.4134 47.5828 130.0270 107.7077 18.6911 296.6756 5.4606 6.5957 40.2344 217.7469 9.5995 124.2530 151.8045 179.9411 188.6124 4.3798 13.3825 80.9397 3.1412 230.2734 0.2758 1.2166 37.4725 1.2883 0.7461 7.0420 1.0483 4.0870 2.3429 1.6152 29.8907
temp: 298.150 k
press: 1.00000 atm
elementType: 16 9 9 9 9 9 9 8 8 7 6 6 6 6 6 6 6 6 1 1 1 1 1
symmnumber: 1
zpe: 331581.2 jmol-1
zpe.correction: 0.126293 hartree
zpe.thermalcorrener: 0.144605 hartree
zpe.thermalcorrenthalpy: 0.145549 hartree
zpe.thermalcorrgfe: 0.074744 hartree
zpe.sumelectzpe: -1508.628158 hartree
zpe.sumelectthermal: -1508.609846 hartree
zpe.sumelectthermalent: -1508.608902 hartree
zpe.sumelectthermalfe: -1508.679707 hartree
dipole: -1.7452 0.8944 0.4484
dipole: 2.0116
quadrupole: -133.9885 -107.5809 -108.3936
quadrupole: -11.8472 -1.3297 4.9515
quadrupole: -17.3341 9.0734 8.2607 -11.8472 -1.3297 4.9515
hfenergy: -1508.7544508 hartree
pointgroup: C01 [X(C8H5F6N1O2S1)]
dipole: -0.7060857 0.3404188 0.1092594 debye
dipolederiv: 1.6119473 -0.0197092 0.0242959 0.3864065 1.1181657 -0.0850475 0.1326572 -0.1107942 1.233438 -0.3506873 -0.3470618 -0.0648079 -0.0568838 -0.7947412 0.0201447 -0.1465481 -0.0894808 -0.3494671 -0.82227 0.407383 -0.1759285 0.6432401 -0.7150014 0.2567673 -0.274341 0.241686 -0.3355243 -0.1630076 -0.0682446 0.2760507 0.1615027 -0.3839516 0.0759647 -0.1262128 0.2392321 -0.9121575 -0.6508575 -0.1443325 0.2320218 -0.1900465 -0.3318018 0.0704658 0.2276916 0.0686226 -0.6391667 -0.8073142 -0.046339 -0.2950611 -0.0684714 -0.3808244 0.0794725 -0.3537476 0.060646 -0.5458863 -0.4505348 0.0273595 0.0038455 -0.0321588 -0.7591405 -0.1182832 -0.0176273 -0.1407075 -0.308733 -0.8428415 -0.0009265 0.0947085 0.0182156 -0.4277802 -0.0271228 0.2198009 0.0521293 -0.5465687 -0.5710813 0.0014711 0.02868 -0.1717074 -0.5632878 -0.0152131 -0.1486643 -0.0744873 -0.4508853 -0.1113993 -0.0886294 0.1024522 -0.5389007 -0.1769504 0.1138601 0.1952847 0.0974167 -0.5327553 0.2438307 -0.0021623 -0.2373089 -0.0713325 0.0161169 -0.0252503 -0.2303626 -0.0420466 0.0606279 -0.0158781 0.0321579 0.0323543 0.1089616 -0.0589202 0.0616677 -0.1399318 0.0152382 -0.0386789 -0.2846488 -0.0773469 -0.043861 -0.1011966 -0.2546951 0.0140065 0.1260901 0.0183761 -0.096648 0.0474396 0.0856981 -0.0341224 -0.0804668 -0.0127081 -0.0092867 0.0091585 0.03151 -0.0952714 1.0765715 0.0304748 -0.0140518 -0.5792599 1.6825368 -0.2707845 0.2633128 -0.2766591 1.443909 -0.0309303 -0.0162047 -0.0837145 0.0809373 -0.0223146 0.0113593 -0.0112308 0.0468797 -0.0517745 -0.214481 -0.0136771 -0.0262432 -0.1570766 0.1224055 0.1356129 -0.0028117 0.1367059 -0.0115109 2.0238947 0.2791907 0.0931854 0.5108376 1.5673313 -0.0412195 0.1867822 -0.0305844 1.4644793 0.0432729 -0.0099728 -0.0607068 0.1071947 0.1032216 -0.0770088 -0.0248112 -0.0497255 0.2807081 0.1134174 0.0325027 0.0536784 0.03973 0.0497243 -0.0518514 0.027411 -0.0552479 0.1031724 0.0571289 -0.0740673 0.0084616 -0.0366295 0.1060751 -0.010334 -0.0028274 -0.014576 0.1187517 0.0189009 0.0078375 0.0608092 0.0076899 0.12369 -0.0189926 0.0498759 -0.0261256 0.1176062 0.0795279 0.0045986 0.0252625 0.0194146 -0.0071501 -0.0889269 0.0410517 -0.0980074 0.0923351 unknown
polarizability: 211.4321717|-9.2063365|126.0496002|-13.1785385|12.4610333|102.416038 unknown
InChI: InChI=1S/C8H5F6NO2S/c9-7(10,11)5-2-1-3-6(4-5)15-18(16,17)8(12,13)14/h1-4,15H
charge 0 multiplicity 1
23 atoms
S  2.899288 0.630365 -0.409824
F  1.786298 -1.9712 0.120573
F  3.889968 -1.759747 0.965584
F  2.136426 -0.777962 2.033194
F  -4.062672 -0.964324 0.929204
F  -4.271533 -0.41367 -1.255811
F  -2.874006 -2.090566 -0.647444
O  4.053101 0.303427 -1.485788
O  2.959119 1.871369 0.615944
N  1.26864 0.770156 -1.402914
C  0.056139 0.930174 -0.683311
C  -0.970378 -0.049571 -0.76382
C  -2.202621 0.186487 -0.123533
C  -0.14676 2.116803 0.076777
C  2.672998 -1.121371 0.801693
C  -2.409286 1.359482 0.641892
C  -1.371094 2.312265 0.74461
C  -3.32429 -0.805422 -0.267753
H  1.293654 -0.006265 -2.086898
H  -0.809474 -0.979271 -1.32047
H  0.650131 2.863446 0.128428
H  -3.363149 1.519387 1.153391
H  -1.525202 3.219709 1.335876
