program: Gaussian 09
title: 000007877
version: EM64L-G09RevD.01
frameworkgroup: C1[X(C7H13NO)]
method: RPBEPBE
basis: SDD
operation: Freq
keyword: #p
keyword: freq=noraman
keyword: PBEPBE/SDD
title: #p freq=noraman PBEPBE/SDD
converged: YES YES NO NO
title: Mulliken charges:
elementType: O N C C C C C C C H H H H H H H H H H H H H
charge: -0.293280 -0.437725 0.316716 -0.751450 -0.691139 -0.691193 0.272763 -0.233596 -0.491281 0.217154 0.229817 0.217957 0.271948 0.205440 0.203644 0.205820 0.203411 0.272154 0.298716 0.203680 0.220173 0.250270
chargesum: 0.00000
title: Mulliken charges with hydrogens summed into heavy atoms:
elementType: O N C C C C C C C
charge: -0.293280 -0.139009 0.316716 -0.086522 -0.010107 -0.009808 0.272763 -0.029916 -0.020837
polarizability: 1.21148600e+02 3.55791372e+00 8.12120865e+01 -5.16628590e-02 -1.56106685e-02 6.12776464e+01
1716.lowfreq: -9.7741 -0.0011 -0.0009 -0.0006 6.2009 21.2243 70.6821 91.5842 150.0427
frequency: 70.6556 91.5015 150.0420 156.5539 200.4158 260.7264 263.3740 270.4629 307.7803 330.4740 337.1089 406.3287 435.1269 490.5417 497.5848 549.3168 657.7799 759.6012 785.0659 887.4070 913.4345 925.0273 934.8375 950.7051 977.8238 992.6452 1030.7151 1034.8125 1056.3944 1186.8011 1231.7174 1233.5651 1257.0615 1312.1032 1368.6285 1369.6623 1394.7196 1402.2061 1448.1254 1454.8933 1465.8284 1473.3178 1485.3298 1488.6398 1504.0803 1593.7205 1648.9019 2972.3063 2982.8810 2987.2469 3064.2929 3077.0939 3081.2913 3089.5528 3093.0904 3105.5629 3107.5292 3109.4456 3216.4226 3529.5198
redmass: 4.2818 2.9017 3.2402 2.4578 1.0177 1.1085 1.0479 2.8776 2.8782 2.2081 3.3308 2.7477 1.9673 2.5849 1.6817 1.4524 3.2573 3.7386 3.6988 3.0092 1.6879 1.6801 2.8744 1.2137 1.3511 1.1095 1.3842 1.4187 1.6103 1.9155 2.5263 3.0646 2.7465 1.5704 1.2041 1.2111 1.2192 1.2036 1.0479 1.3618 1.0526 1.0484 1.0532 1.3764 1.0626 6.3801 4.7010 1.0363 1.0354 1.0362 1.1004 1.1002 1.0995 1.0714 1.0978 1.1000 1.0816 1.0992 1.1162 1.0773
irintensity: 6.3157 5.2553 2.4844 0.1881 0.1298 0.5863 0.1605 5.3942 2.6100 0.0856 7.1499 0.5073 1.5493 0.3338 59.8240 22.9294 1.6487 0.1379 30.0604 4.7384 0.3756 4.4540 10.1245 0.7486 2.9303 82.0586 0.0738 1.7861 5.2810 27.5105 88.6714 22.8382 43.3769 21.1249 31.8532 40.7521 30.7348 28.0452 0.3227 181.4685 3.9489 1.2355 9.5353 101.5278 17.5475 93.2383 13.3910 26.3122 37.1343 26.7791 26.2281 33.0419 28.6765 11.9512 54.7192 2.1273 13.1884 17.7148 8.2240 16.5505
temp: 298.150 k
press: 1.00000 atm
elementType: 8 7 6 6 6 6 6 6 6 1 1 1 1 1 1 1 1 1 1 1 1 1
symmnumber: 1
zpe: 493219.0 jmol-1
zpe.correction: 0.187857 hartree
zpe.thermalcorrener: 0.198737 hartree
zpe.thermalcorrenthalpy: 0.199681 hartree
zpe.thermalcorrgfe: 0.152386 hartree
zpe.sumelectzpe: -403.791624 hartree
zpe.sumelectthermal: -403.780744 hartree
zpe.sumelectthermalent: -403.779800 hartree
zpe.sumelectthermalfe: -403.827095 hartree
dipole: 1.1971 3.6047 0.0137
dipole: 3.7983
quadrupole: -49.4738 -55.9336 -58.0482
quadrupole: -3.7056 -0.0076 0.0034
quadrupole: 5.0114 -1.4484 -3.5630 -3.7056 -0.0076 0.0034
hfenergy: -403.9794809 hartree
pointgroup: C01 [X(C7H13N1O1)]
dipole: -0.4815869 1.4140282 0.0413294 debye
dipolederiv: -0.7087672 -0.0325952 0.0002632 0.0854901 -0.9010332 -0.0165628 0.0035836 -0.0165027 -0.3804171 -1.2109098 0.2676383 0.0109637 0.3186664 -0.4505017 -0.0019682 0.017199 -0.0044287 -0.5206657 0.7790074 0.0348485 0.000407 0.1410286 0.2594837 -0.0025909 0.001913 -0.0017582 0.3630741 -0.0840963 0.0447922 0.0019973 0.0423208 -0.0327594 -0.004243 0.0014939 -0.0043589 0.061798 -0.1178026 0.0527485 -0.0005354 0.0069676 -0.0490694 -0.0677098 0.0010623 -0.0988773 -0.0787869 -0.1163272 0.0526371 0.0048644 0.0085294 -0.0616664 0.0685161 0.0001904 0.0988568 -0.0664735 1.4932645 -0.1704497 -0.0110257 -0.2025276 0.9992384 0.0242292 -0.0119148 0.0250455 0.2555097 -0.344349 -0.0910853 -0.0025811 -0.0507102 0.0773874 0.0102588 -0.0013665 0.0103304 -0.2021505 -0.0390731 0.0607929 0.0002779 -0.040577 0.0526822 0.0122354 -0.002495 0.0117145 -0.3016692 0.0960824 -0.0337226 0.0484097 0.0125339 -0.0270523 0.1091985 0.0210595 0.1427748 -0.0777047 -0.1394104 -0.0378682 -0.0008901 -0.1092504 0.0615297 -0.0012756 -0.0036042 -0.0013478 0.1037356 0.0964333 -0.030376 -0.0511859 0.0135805 -0.0082301 -0.1037239 -0.0205423 -0.1371615 -0.0951513 0.0838956 0.1096103 0.0453676 0.0915697 -0.0031946 -0.0308704 0.0354525 0.0064308 0.0996494 0.1043633 -0.029999 0.0191139 -0.007501 -0.012131 0.1412838 0.0116437 0.0819351 -0.1073555 -0.1672378 -0.1043697 -0.0212595 -0.1122045 0.0741517 -0.0121515 -0.0097288 0.0042741 0.075649 0.104391 -0.0291349 -0.0232151 -0.0077908 0.0038072 -0.1330349 -0.0141323 -0.0736004 -0.1223669 -0.1678123 -0.1053011 0.0155311 -0.1114784 0.0742404 0.0125943 0.0026035 -0.0034501 0.0760706 0.084863 0.1124473 -0.0372241 0.0936248 -0.0045435 0.0224835 -0.0285496 -0.0148099 0.1016109 0.1518368 -0.0308237 -0.0004084 -0.0811339 0.0720442 -0.0050471 -0.0030754 -0.0032373 0.2912248 0.0206347 0.0514173 0.0026539 -0.0194312 -0.1406503 -0.0104967 0.0002657 -0.0108304 0.170003 -0.0540684 -0.0829672 -0.0015742 -0.1014124 0.0394928 -0.0038335 -0.002186 -0.0040043 0.1699349 0.1350823 -0.0082397 0.0000497 0.0297057 -0.0232261 -0.0072913 0.0011277 -0.0069946 0.1844814 unknown
polarizability: 121.1981294|-3.2483125|81.1394601|-0.3953354|0.6573264|61.300743 unknown
InChI: InChI=1S/C7H13NO/c1-5-6(9)8-7(2,3)4/h5,8H,1H2,2-4H3
charge 0 multiplicity 1
22 atoms
O  1.063471 -1.351577 -0.050365
N  -0.158693 0.647394 0.020389
C  -1.538526 0.067671 0.003313
C  -2.519199 1.264219 0.049699
C  -1.748901 -0.746972 -1.300935
C  -1.741772 -0.83851 1.246597
C  1.022958 -0.079108 -0.008886
C  2.261861 0.772062 0.012584
C  3.497062 0.211982 -0.013995
H  -2.385131 1.926452 -0.826854
H  -3.559466 0.896658 0.038048
H  -2.380631 1.859135 0.972374
H  -1.015695 -1.567724 -1.358998
H  -1.629191 -0.100221 -2.189229
H  -2.767076 -1.176808 -1.315514
H  -1.613175 -0.258029 2.17832
H  -2.761379 -1.264953 1.237499
H  -1.01061 -1.662858 1.239839
H  -0.087607 1.667154 0.04576
H  2.141593 1.864603 0.050724
H  4.410507 0.815549 0.00113
H  3.591702 -0.879818 -0.0516
