program: Gaussian 09
title: 000090075
version: EM64L-G09RevD.01
frameworkgroup: C1[X(C17H19NO3)]
method: RPBEPBE
basis: SDD
operation: Freq
keyword: #p
keyword: freq=noraman
keyword: PBEPBE/SDD
title: #p freq=noraman PBEPBE/SDD
converged: YES YES NO NO
title: Mulliken charges:
elementType: O O O N C C C C C C C C C C C C C C C C C H H H H H H H H H H H H H H H H H H H
charge: -0.323220 -0.432533 -0.434536 -0.073038 -0.355724 -0.462821 0.290867 -0.502949 0.282387 0.529203 -0.516379 -0.514375 -0.625021 0.208136 0.105986 -0.452314 -0.365203 -0.354003 -0.400702 0.269392 -0.524023 0.248737 0.201277 0.231283 0.235349 0.190266 0.262176 0.255709 0.224778 0.230319 0.186552 0.239285 0.250081 0.249744 0.218067 0.378115 0.228319 0.227678 0.240596 0.352539
chargesum: 0.00000
title: Mulliken charges with hydrogens summed into heavy atoms:
elementType: O O O N C C C C C C C C C C C C C C C C C
charge: -0.323220 -0.054418 -0.081998 -0.073038 -0.106987 -0.030261 0.290867 -0.077335 0.282387 0.529203 -0.254203 -0.258666 0.016628 0.208136 0.105986 -0.213029 -0.115122 -0.104259 -0.182635 0.269392 0.172570
polarizability: 2.45947861e+02 -1.62150854e+01 2.17275891e+02 -1.30336691e+01 -4.08558751e+00 1.44566167e+02
1716.lowfreq: -6.0401 -0.0006 -0.0003 0.0005 1.6554 3.9068 29.8537 36.2813 45.4118
frequency: 29.8074 36.2676 45.4018 73.8644 84.4366 113.8566 133.6512 169.7752 182.1996 192.1915 206.8722 222.0352 243.1735 260.6873 264.7850 309.7785 317.9129 345.7849 354.9229 366.6593 375.1068 398.5172 405.8674 412.0226 439.9130 465.8249 484.9404 513.1596 536.4145 542.0443 567.7356 597.7515 635.6057 649.1413 699.0915 725.6325 732.3019 752.2546 779.6454 809.7299 817.6822 827.9376 836.6840 861.4048 870.3367 893.5258 938.1830 961.1351 967.8194 981.4121 1004.2676 1005.4876 1031.5276 1068.5042 1092.8688 1100.2716 1117.6635 1117.9941 1136.0223 1143.6779 1156.2504 1172.7623 1177.7966 1179.5207 1186.1750 1209.6824 1218.5015 1233.2106 1245.0418 1255.6785 1266.0493 1280.1813 1291.3895 1316.0094 1325.1953 1339.7838 1366.1851 1390.4958 1411.4207 1425.7125 1431.3608 1439.6038 1443.1407 1460.3593 1463.6099 1464.4465 1475.4087 1478.2182 1482.0167 1502.0701 1505.8255 1595.5490 1602.4617 1624.8684 1634.8696 2790.2246 2834.9826 2854.7121 2965.0696 2971.9579 3001.1682 3017.4145 3036.4522 3053.6844 3077.6783 3107.9077 3121.9798 3125.3349 3140.2858 3144.0348 3147.6756 3168.8383 3515.2882 3581.3306
redmass: 4.7774 3.9752 4.6484 3.8059 2.9896 3.8037 4.7495 2.5686 3.0011 3.9860 3.2913 1.5756 1.3143 3.2059 3.6853 3.9998 2.3197 5.2329 1.1094 4.6395 3.7235 4.0089 4.7600 2.9970 2.8762 3.8889 1.1166 4.1214 5.5281 2.8902 4.5697 3.8243 7.0286 6.8368 4.1854 3.1519 3.6984 5.5746 5.3371 1.4261 3.0410 3.9494 1.7063 1.5637 1.4243 3.4994 1.3937 1.3601 2.3843 2.4695 2.9013 2.6679 2.1476 2.2621 3.7773 1.4631 1.4638 1.2758 2.6228 1.3732 1.3547 1.5557 2.4405 1.1156 1.3481 1.5358 1.6740 1.8900 2.5898 1.8313 1.6740 1.8864 3.1962 1.4299 1.2929 1.6087 1.5345 5.7483 3.5956 2.7423 1.2857 3.0536 1.2491 1.0897 1.0571 1.0493 1.0912 1.1377 1.0656 2.7278 3.1564 6.5629 7.8218 6.3851 6.9590 1.0712 1.0679 1.0589 1.0325 1.0823 1.0849 1.0723 1.0892 1.1042 1.1007 1.0883 1.0898 1.1002 1.0951 1.0912 1.0908 1.0950 1.0645 1.0660
irintensity: 0.9503 1.9886 0.3769 2.3473 1.8792 1.3092 2.3911 0.8090 1.5465 2.1630 2.7474 0.2249 0.9572 0.8158 4.5493 1.1836 5.5346 2.5765 138.7525 4.5745 5.7031 8.7176 1.3117 0.4577 10.3211 2.4280 136.2824 3.9689 12.6626 34.1967 11.4535 19.2639 0.2008 3.8434 2.6316 1.5942 0.8151 22.7868 12.0020 13.6784 31.5346 21.8059 48.0206 2.1570 32.3568 7.8517 0.4646 0.0773 7.8300 18.5908 11.3637 18.8095 6.7146 15.5681 25.3569 38.9844 11.9491 1.8836 125.3824 220.1995 27.3264 80.3069 16.0096 7.9973 17.8855 6.5766 113.9032 4.6902 31.0527 16.7203 71.0491 4.8657 85.8453 17.9753 19.5710 8.8495 26.2565 11.8775 7.5299 18.7112 5.2150 0.4064 24.5485 12.7952 20.0617 15.9244 74.9345 5.9528 6.9874 101.4082 174.9259 16.7528 8.8774 33.6010 5.8126 78.9587 62.8598 197.2148 51.6401 17.9484 32.0520 53.2230 33.3593 41.1349 31.8974 22.9046 12.7868 26.1481 10.3267 11.4880 2.1590 7.6693 80.5192 39.9694
temp: 298.150 k
press: 1.00000 atm
elementType: 8 8 8 7 6 6 6 6 6 6 6 6 6 6 6 6 6 6 6 6 6 1 1 1 1 1 1 1 1 1 1 1 1 1 1 1 1 1 1 1
symmnumber: 1
zpe: 849097.6 jmol-1
zpe.correction: 0.323404 hartree
zpe.thermalcorrener: 0.342880 hartree
zpe.thermalcorrenthalpy: 0.343824 hartree
zpe.thermalcorrgfe: 0.275433 hartree
zpe.sumelectzpe: -938.065620 hartree
zpe.sumelectthermal: -938.046145 hartree
zpe.sumelectthermalent: -938.045201 hartree
zpe.sumelectthermalfe: -938.113591 hartree
dipole: 1.9923 -1.1098 1.1402
dipole: 2.5497
quadrupole: -138.5759 -105.3009 -118.3171
quadrupole: -4.3736 7.3026 1.1202
quadrupole: -17.8446 15.4304 2.4142 -4.3736 7.3026 1.1202
hfenergy: -938.3890245 hartree
pointgroup: C01 [X(C17H19N1O3)]
dipole: -0.7586487 0.4706365 0.4573753 debye
polarizability: 242.6376884|-19.1020138|219.388359|14.5901697|6.7308515|145.7638717 unknown
InChI: InChI=1S/C17H19NO3/c1-18-9-12-7-16(20)17(21-2)8-14(12)15(10-18)11-3-5-13(19)6-4-11/h3-8,15,19-20H,9-10H2,1-2H3
charge 0 multiplicity 1
40 atoms
O  2.533306 3.026933 0.120747
O  4.554035 1.462142 0.936704
O  -5.291033 1.777216 0.741803
N  0.731141 -3.228166 -0.3609
C  -0.421549 -1.040703 -0.59077
C  -0.502976 -2.487777 -0.033905
C  0.892378 -0.380511 -0.151432
C  1.894831 -2.686258 0.370533
C  1.990913 -1.169088 0.275198
C  -1.680236 -0.257213 -0.220201
C  1.036747 1.032292 -0.223465
C  3.209576 -0.542458 0.641558
C  0.603837 -4.685719 -0.188177
C  2.247103 1.642369 0.13786
C  3.346243 0.850528 0.577106
C  -2.669542 0.026848 -1.19625
C  -1.923406 0.161901 1.113478
C  -3.863172 0.702064 -0.866378
C  -3.110587 0.838661 1.463888
C  -4.08341 1.105815 0.4692
C  1.470958 3.929304 -0.321371
H  -0.393674 -1.13839 -1.69552
H  -0.69179 -2.450759 1.071389
H  -1.362613 -3.006475 -0.495689
H  2.813314 -3.143186 -0.046027
H  1.859196 -2.978075 1.456901
H  0.183956 1.633829 -0.553817
H  4.069766 -1.133602 0.973974
H  1.52979 -5.182499 -0.531237
H  -0.233329 -5.062858 -0.801579
H  0.423611 -4.993514 0.874088
H  -2.503433 -0.286791 -2.234407
H  -1.166218 -0.026492 1.883393
H  -4.625421 0.921398 -1.61985
H  -3.278081 1.155692 2.502104
H  4.451456 2.443083 0.812269
H  0.584154 3.849825 0.336557
H  1.176762 3.713017 -1.366339
H  1.896182 4.941635 -0.255517
H  -5.357785 2.002281 1.702879
