program: Gaussian 09
title: 000090227
version: EM64L-G09RevD.01
frameworkgroup: C1[X(C22H23O4P)]
method: RPBEPBE
basis: SDD
operation: Freq
keyword: #p
keyword: freq=noraman
keyword: PBEPBE/SDD
title: #p freq=noraman PBEPBE/SDD
converged: YES YES NO NO
title: Mulliken charges:
elementType: P O O O O C C C C C C C C C C C C C C C C C C C C C C H H H H H H H H H H H H H H H H H H H H H H H
charge: 1.329746 -0.560182 -0.529092 -0.542703 -0.573717 0.070604 0.064701 0.359132 0.352770 0.376629 0.355597 -0.416064 -0.413366 -0.410622 -0.408517 -0.224899 -0.225819 -0.799817 -0.809020 -0.811433 -0.807386 0.379057 -0.332559 -0.365736 -0.196817 -0.193635 -0.243893 0.236507 0.236926 0.236001 0.236132 0.226789 0.226722 0.238330 0.215230 0.273639 0.214729 0.278437 0.240963 0.241115 0.277889 0.220448 0.279516 0.217764 0.240972 0.284115 0.258619 0.232030 0.232429 0.231740
chargesum: 0.00000
title: Mulliken charges with hydrogens summed into heavy atoms:
elementType: P O O O O C C C C C C C C C C C C C C C C C C C C C C
charge: 1.329746 -0.560182 -0.529092 -0.542703 -0.573717 0.070604 0.064701 0.359132 0.352770 0.376629 0.355597 -0.179557 -0.176440 -0.174621 -0.172386 0.001889 0.000903 -0.072618 -0.074891 -0.071981 -0.069134 0.379057 -0.048443 -0.107117 0.035213 0.038794 -0.012154
polarizability: 3.07218842e+02 -6.34372845e+00 2.87316815e+02 2.20070500e+00 -1.45116678e+01 2.38464356e+02
1716.lowfreq: -10.5746 -8.0674 -6.3400 -4.4794 -0.0014 -0.0008 -0.0007 8.9242 12.3647
frequency: -9.4998 8.1467 9.8440 21.3556 37.0737 47.2777 69.7557 89.9377 93.9353 104.5608 116.2424 127.1913 131.1160 143.9799 151.0760 158.1561 171.5639 189.3039 226.2469 228.0541 235.0708 245.6516 262.7211 281.5147 291.0538 318.0575 327.6311 329.7091 377.3236 408.5608 412.9003 465.2835 470.9733 475.3719 479.2987 482.7451 517.2455 517.6172 536.2771 537.2510 539.0956 542.3400 556.0900 584.7871 607.8654 614.7561 657.5431 689.3332 705.7109 722.8868 735.3036 736.6125 765.3629 780.0821 781.0837 821.7637 828.5382 833.7111 835.1543 895.4331 896.7615 914.8037 918.8488 919.4123 969.6667 975.8122 975.9558 986.7492 989.5589 991.1612 991.6193 1019.7227 1034.4267 1042.4795 1043.5376 1050.9871 1052.1344 1054.4172 1055.2545 1075.2909 1079.9263 1084.5234 1126.3752 1131.7201 1152.2079 1170.5814 1177.2634 1177.4482 1182.9012 1259.4322 1260.4794 1275.9156 1276.7720 1308.8806 1369.7022 1370.5492 1380.8925 1402.1550 1405.8417 1406.4696 1407.8958 1421.3753 1421.9338 1440.0108 1453.7728 1454.7334 1461.7413 1462.3433 1463.9320 1465.6320 1468.6142 1483.9964 1487.5170 1487.8979 1489.3960 1592.5621 1592.7899 1594.2082 1601.8355 1607.9120 1609.3554 2981.3065 2984.1690 2985.8954 2986.0149 3062.7150 3064.8054 3066.8295 3067.6853 3091.8610 3093.5775 3094.7741 3094.9854 3125.0147 3125.5395 3133.2416 3135.8918 3136.5774 3144.1533 3158.9923 3159.5177 3159.9375 3170.8318 3178.3310
redmass: 4.4292 4.3863 4.2185 5.1220 4.6305 4.4963 5.0952 3.1134 1.6075 2.3037 2.5341 1.5188 2.2676 1.2101 1.4678 2.0893 4.0198 5.5595 3.0345 2.9834 4.8182 4.6229 4.1128 3.5278 3.3541 4.9979 4.8053 4.7975 6.7360 2.9299 7.1352 4.1218 4.2049 4.4182 6.1890 4.5754 3.1000 3.1059 5.3819 5.6435 5.4845 4.5352 4.2262 5.5446 6.4632 5.8594 7.4094 2.2066 8.1211 7.9903 4.3013 4.4314 1.5664 1.2108 1.2070 6.5651 6.3981 2.9377 1.7211 1.3120 1.3088 1.4220 2.6422 2.6549 1.3764 1.3364 1.3385 4.8747 1.6238 1.4043 1.6095 2.1761 11.5229 1.7580 1.7447 1.5341 1.5494 1.5217 1.5515 1.5375 2.4696 2.1602 2.6745 3.0773 2.5040 1.0945 1.1652 1.1704 1.2942 1.5753 1.5698 3.3015 3.2985 1.3205 6.9711 7.0201 9.4873 1.2397 1.2466 1.2289 1.2291 2.5854 2.5493 2.2280 1.8693 1.9184 1.0766 1.0848 1.0684 1.0649 2.1129 1.2356 1.1994 1.1962 1.1948 5.3376 5.4805 5.9456 6.6857 8.0506 8.0396 1.0370 1.0369 1.0366 1.0369 1.0975 1.0973 1.0966 1.0971 1.0994 1.1002 1.0996 1.1001 1.0857 1.0857 1.0852 1.0921 1.0920 1.0898 1.0995 1.0993 1.0942 1.0967 1.0997
irintensity: 0.4003 0.0988 0.2725 0.3825 0.1358 0.5228 0.9217 0.4063 0.3013 1.1045 0.3478 0.8380 0.7673 0.8797 1.0531 1.6903 4.4962 2.3549 0.3025 0.8319 5.6428 10.5688 5.3345 2.1126 4.0259 4.7693 6.5456 7.3009 49.0077 1.7265 37.2642 6.2973 24.0898 24.6046 32.9441 12.4457 0.1115 0.0744 1.0943 1.0909 1.2344 7.8640 8.4065 5.7840 4.5011 30.4926 31.0969 24.5809 87.9318 99.4959 10.2831 17.2394 99.3326 58.1454 59.8612 85.0300 262.4205 145.4993 73.9123 0.0298 0.0185 11.0244 4.2662 2.5531 0.6054 0.2572 0.2633 2.5312 6.2808 2.2930 3.8547 27.2003 73.5589 0.3395 0.0212 12.1419 19.0306 2.0213 8.5577 8.1267 167.0321 68.3615 95.0961 108.9015 100.7416 8.0290 1.4158 1.6693 37.7019 0.0458 0.0291 7.2831 4.1368 0.2287 4.8844 5.2277 0.5268 16.2548 12.7792 6.5016 8.7530 13.1237 8.4302 8.1827 1.7395 1.3177 12.4080 9.2062 9.3331 8.9234 125.5320 65.4624 36.0394 26.5608 36.6721 1.8720 12.6753 32.1703 19.2071 3.7636 4.3220 16.3013 21.4814 4.9763 31.5493 7.7480 7.3309 10.0384 7.2331 21.9138 20.1049 35.3782 8.7399 0.1402 0.1764 0.2056 21.5659 21.3373 14.9760 38.9177 36.2607 19.8055 6.3403 7.3189
temp: 298.150 k
press: 1.00000 atm
elementType: 15 8 8 8 8 6 6 6 6 6 6 6 6 6 6 6 6 6 6 6 6 6 6 6 6 6 6 1 1 1 1 1 1 1 1 1 1 1 1 1 1 1 1 1 1 1 1 1 1 1
symmnumber: 1
zpe: 1028556.8 jmol-1
zpe.correction: 0.391757 hartree
zpe.thermalcorrener: 0.418223 hartree
zpe.thermalcorrenthalpy: 0.419167 hartree
zpe.thermalcorrgfe: 0.331995 hartree
zpe.sumelectzpe: -1492.321826 hartree
zpe.sumelectthermal: -1492.295360 hartree
zpe.sumelectthermalent: -1492.294416 hartree
zpe.sumelectthermalfe: -1492.381587 hartree
dipole: 0.2449 0.1937 0.6027
dipole: 0.6788
quadrupole: -147.4654 -155.7595 -160.4095
quadrupole: -2.4091 0.4673 -3.1922
quadrupole: 7.0794 -1.2147 -5.8647 -2.4091 0.4673 -3.1922
hfenergy: -1492.7135826 hartree
pointgroup: C01 [X(C22H23O4P1)]
dipole: 0.1013873 -0.049125 0.2421184 debye
polarizability: 287.3981983|-4.2545262|308.0830974|-9.5501946|-9.063453|237.5187178 unknown
InChI: InChI=1S/C22H23O4P/c1-16-10-8-11-17(2)21(16)25-27(23,24-20-14-6-5-7-15-20)26-22-18(3)12-9-13-19(22)4/h5-15H,1-4H3
charge 0 multiplicity 1
50 atoms
P  -0.00118 -0.317367 -0.236375
O  -1.099631 0.79827 0.504119
O  1.458552 0.01551 0.629404
O  -0.455358 -1.793988 0.551452
O  0.045634 -0.346493 -1.82357
C  -2.406829 1.086503 -0.032479
C  2.21851 1.22995 0.461111
C  -3.515521 0.47824 0.609472
C  2.070564 2.227543 1.458966
C  -2.521237 2.046821 -1.069449
C  3.154767 1.306901 -0.601631
C  -4.804532 0.84237 0.147051
C  2.88716 3.379995 1.341149
C  -3.832715 2.377437 -1.494066
C  3.947525 2.48005 -0.673677
C  -4.963973 1.7781 -0.898737
C  3.811842 3.511003 0.281734
C  -3.327589 -0.50212 1.749172
C  1.096692 2.058501 2.606353
C  -1.302003 2.69437 -1.694688
C  3.314536 0.182041 -1.605008
C  0.16342 -3.049301 0.234849
C  0.219758 -3.53225 -1.090691
C  0.63098 -3.806191 1.328281
C  0.769833 -4.815053 -1.314465
C  1.165983 -5.091119 1.086074
C  1.239712 -5.596832 -0.233332
H  -5.683427 0.388069 0.618555
H  2.796118 4.17194 2.093254
H  -3.958596 3.114274 -2.295526
H  4.679348 2.573658 -1.484212
H  -5.968773 2.046181 -1.243183
H  4.43405 4.409617 0.20748
H  -2.81158 -0.023469 2.602027
H  -4.301325 -0.882827 2.100233
H  -2.69897 -1.359146 1.448792
H  1.138713 2.926319 3.285843
H  0.061412 1.944345 2.238738
H  1.325427 1.146603 3.187767
H  -0.606892 3.075101 -0.924112
H  -0.738532 1.966617 -2.3077
H  -1.597247 3.536309 -2.342856
H  2.406923 0.059388 -2.223947
H  4.169805 0.376362 -2.273341
H  3.481762 -0.784348 -1.094841
H  -0.150385 -2.91982 -1.918702
H  0.570684 -3.386484 2.336575
H  0.823398 -5.203646 -2.337228
H  1.528936 -5.691354 1.927392
H  1.659053 -6.59178 -0.416829
