program: Gaussian 09
title: 000090001
version: EM64L-G09RevD.01
frameworkgroup: C1[X(C14H9BrOS)]
method: RPBEPBE
basis: SDD
operation: Freq
keyword: #p
keyword: freq=noraman
keyword: PBEPBE/SDD
title: #p freq=noraman PBEPBE/SDD
converged: YES YES NO NO
title: Mulliken charges:
elementType: Br S O C C C C C C C C C C C C C C H H H H H H H H H
charge: -0.038834 0.225312 -0.249313 0.398209 -0.329322 0.383840 0.059685 -0.311748 -0.482319 0.525073 -0.282053 -0.333003 -0.334601 -0.290821 -0.858541 -0.243736 -0.218745 0.290271 0.249467 0.247928 0.287850 0.247904 0.286239 0.292626 0.239899 0.238732
chargesum: 0.00000
title: Mulliken charges with hydrogens summed into heavy atoms:
elementType: Br S O C C C C C C C C C C C C C C
charge: -0.038834 0.225312 -0.249313 0.398209 -0.329322 0.383840 0.059685 -0.311748 -0.192048 0.525073 -0.032586 -0.085075 -0.046751 -0.042917 -0.279676 -0.003836 0.019986
polarizability: 3.29806420e+02 -8.33431792e+00 1.84474091e+02 -1.06718590e+01 -5.57744424e+00 9.25261284e+01
1716.lowfreq: -7.0246 -3.8061 -0.0013 -0.0004 0.0021 1.4878 24.4422 33.6898 58.3088
frequency: 24.4411 33.6774 58.3084 105.8897 132.4834 164.9576 178.3734 217.3572 267.9317 297.2224 329.9759 362.7946 404.7866 406.2044 425.1378 446.5759 454.0721 484.0359 496.4432 564.6881 599.7166 626.2348 654.4757 676.5143 693.0246 726.4558 732.2215 758.6945 807.1300 830.0420 839.0264 874.6975 885.8625 958.3922 973.1758 977.0317 980.0618 1009.2391 1027.7326 1050.1734 1055.6063 1101.7716 1120.4788 1134.5491 1165.0337 1174.7528 1208.4298 1222.0939 1235.7603 1269.2681 1299.7966 1384.9533 1391.2442 1404.5808 1425.2910 1454.3352 1459.6785 1466.8387 1528.4833 1557.0084 1577.9235 1601.6442 1614.0886 3067.9603 3132.7294 3134.2094 3143.4902 3146.1956 3152.7186 3154.3830 3158.6278 3172.4354
redmass: 8.8053 8.2068 11.3348 4.9904 5.8343 7.8534 3.9111 5.5356 4.7652 5.9259 7.5711 4.3061 4.2147 5.4479 12.1445 3.2343 9.2234 4.9823 4.2950 6.2914 4.4577 7.1216 6.4561 6.5086 4.4617 5.7709 4.2819 1.4882 2.9076 2.5363 2.1364 1.5054 1.4285 1.5165 1.4392 1.4165 3.1034 1.3500 3.7074 6.5292 2.5145 1.2205 1.6525 2.1280 1.4137 1.0712 1.1902 2.4209 1.5469 1.5786 2.3673 9.9920 8.4949 3.4606 2.4023 2.3596 1.1494 2.6334 10.2389 6.9203 7.7111 6.1895 6.5599 1.0576 1.0878 1.0866 1.0920 1.0897 1.1102 1.0984 1.0942 1.1006
irintensity: 0.4105 2.2777 1.4827 1.3228 0.4388 1.4922 2.7693 0.7410 4.4912 8.5040 11.9734 2.0806 3.9554 9.4481 3.3013 0.7931 10.3131 28.8975 22.6344 15.1553 57.0644 8.8053 1.9772 0.9062 0.0853 3.7507 3.1956 87.8271 5.5991 10.3249 17.4750 5.4620 0.3199 6.7215 1.2772 2.8862 8.3216 0.9278 37.0796 41.4049 16.9597 0.6535 2.4764 8.3158 19.2798 4.9706 81.7331 90.5112 0.1980 14.6027 79.8281 6.1610 8.0625 19.8817 77.8517 19.8252 7.0297 25.7223 145.4488 1.4035 49.7410 93.3414 31.9830 15.5826 3.7665 0.9681 4.4852 7.8493 0.3044 12.5370 4.5453 30.2093
temp: 298.150 k
press: 1.00000 atm
elementType: 35 16 8 6 6 6 6 6 6 6 6 6 6 6 6 6 6 1 1 1 1 1 1 1 1 1
symmnumber: 1
zpe: 488385.1 jmol-1
zpe.correction: 0.186016 hartree
zpe.thermalcorrener: 0.200088 hartree
zpe.thermalcorrenthalpy: 0.201032 hartree
zpe.thermalcorrgfe: 0.142448 hartree
zpe.sumelectzpe: -1024.493345 hartree
zpe.sumelectthermal: -1024.479273 hartree
zpe.sumelectthermalent: -1024.478329 hartree
zpe.sumelectthermalfe: -1024.536913 hartree
dipole: 3.0141 3.0950 1.1812
dipole: 4.4787
quadrupole: -100.3686 -112.4725 -117.0999
quadrupole: -3.3485 -10.9722 0.3735
quadrupole: 9.6117 -2.4921 -7.1196 -3.3485 -10.9722 0.3735
hfenergy: -1024.6793612 hartree
pointgroup: C01 [X(C14H9Br1O1S1)]
dipole: -1.0078251 1.3101346 -0.6104837 debye
dipolederiv: -0.7037552 0.1551287 -0.1701238 0.2007573 -0.1841483 0.0490812 -0.6776026 0.1897217 -0.431581 -0.7575264 -0.0226923 0.0062199 -0.0148539 -0.1790737 -0.0100984 0.0512913 -0.0129531 0.0473234 -0.6370379 0.0630642 0.0182078 -0.0122883 -1.0411311 -0.098723 0.0261075 -0.0735319 -0.3344355 -0.6452103 -0.2420831 -0.0121512 -0.04046 -0.399508 -0.0164413 0.064343 -0.0241556 0.0337059 0.9517738 -0.3464012 -0.0593417 -0.2209508 0.1300616 0.0186032 -0.0883032 0.0368151 -0.0467068 -0.6695899 0.2089494 0.0649074 0.0453122 -0.2716337 -0.0329283 0.0484354 -0.0384915 0.0039151 1.4161319 0.0183922 -0.0576396 0.1461367 1.0949091 0.1271652 -0.0731479 0.0846589 0.1627801 0.729156 0.4581904 0.007383 0.3474128 0.2590581 0.0240427 -0.0292014 -0.0076424 -0.0426528 0.1725573 0.1188551 0.0157238 -0.0288594 0.0167365 0.0341862 -0.0739416 -0.0009052 -0.0819829 -0.2926993 -0.082573 -0.0501931 0.0629365 -0.1937598 -0.0121775 0.188106 -0.0482968 -0.129111 -0.6679308 0.1085855 -0.0079905 0.0512479 0.1369935 0.0112551 0.0462161 0.0157574 -0.116892 0.1692782 0.0160142 -0.0184752 -0.1822328 0.192928 -0.0019591 -0.0203541 0.0455528 -0.1088398 0.0561985 -0.158387 -0.0310997 0.1066459 0.0254811 0.0048039 0.001636 0.0197223 -0.0873637 -0.5017673 -0.2264267 -0.0111307 -0.2546526 0.0416614 0.0233558 0.0058213 0.032132 -0.1352274 1.0207922 -0.2401533 0.3417236 -0.3794274 0.185901 -0.1137533 0.6521651 -0.192304 0.5958596 -0.0389788 0.2468805 0.013428 0.1027894 -0.0967376 -0.0080378 -0.0001116 -0.0128552 -0.1685378 0.1759722 -0.0146352 -0.0204482 0.0758262 0.1942398 0.0310659 -0.0162869 0.02787 -0.1193273 0.1341477 -0.0009353 0.0111131 0.0780025 0.0238102 -0.0055297 -0.0031058 -0.0074393 0.1319931 0.089848 0.059401 0.0057859 0.0110822 -0.0530332 -0.0123681 0.006976 -0.021166 0.1563464 -0.0527538 -0.0895795 0.0118747 -0.0695614 0.05586 -0.0089942 -0.0026647 -0.0000713 0.1386288 0.1339063 0.052671 0.0079268 -0.0236726 0.019674 -0.0096728 -0.002192 -0.0152629 0.151872 0.1087071 -0.0156241 0.0042938 0.0472376 -0.0599604 -0.0214063 0.0078546 -0.0176253 0.1594335 -0.0626398 0.0141931 -0.0116834 -0.0576769 0.0371454 0.0876948 -0.049842 0.0753908 -0.0625057 0.0290235 -0.043312 -0.0857666 0.0622535 -0.0193152 -0.0421894 -0.0919549 -0.0382892 -0.033851 -0.0466907 -0.0926476 0.0054887 -0.1118172 0.0062422 -0.006277 0.0053569 -0.0058787 0.161799 -0.1109124 0.055125 0.0219671 0.0588126 0.0775992 -0.010698 0.0243995 -0.0107527 0.155358 unknown
polarizability: 329.8943243|-7.0276249|184.6727168|11.0148006|2.1349544|92.2395978 unknown
InChI: InChI=1S/C14H9BrOS/c15-8-9-5-6-13-11(7-9)14(16)10-3-1-2-4-12(10)17-13/h1-7H,8H2
charge 0 multiplicity 1
26 atoms
Br 5.449325 -0.944326 1.356327
S  -0.92572 2.149272 0.168708
O  -0.309358 -2.359829 -0.270543
C  0.696903 -0.185642 -0.135643
C  0.624065 1.229115 -0.013192
C  -1.863112 -0.551106 0.010728
C  -0.483744 -1.102875 -0.138773
C  -2.175061 0.829317 0.150436
C  1.98167 -0.781617 -0.270837
C  3.162383 -0.016595 -0.292148
C  1.807046 2.015871 -0.02983
C  3.058317 1.400574 -0.169095
C  -2.941275 -1.484404 0.011169
C  -3.519322 1.261405 0.285933
C  4.496007 -0.672188 -0.460113
C  -4.272596 -1.065026 0.144572
C  -4.562391 0.318106 0.28284
H  2.008403 -1.874044 -0.355834
H  1.738066 3.104938 0.064703
H  3.966892 2.013636 -0.172366
H  -2.677568 -2.541289 -0.097586
H  -3.742306 2.32861 0.393292
H  5.218822 -0.064411 -1.023014
H  4.432855 -1.689968 -0.869029
H  -5.084575 -1.799078 0.142719
H  -5.598225 0.657954 0.388275
