program: Gaussian 09
title: 000007869
version: EM64L-G09RevD.01
frameworkgroup: C1[X(C8H16)]
method: RPBEPBE
basis: SDD
operation: Freq
keyword: #p
keyword: freq=noraman
keyword: PBEPBE/SDD
title: #p freq=noraman PBEPBE/SDD
converged: YES YES NO NO
title: Mulliken charges:
elementType: C C C C C C C C H H H H H H H H H H H H H H H H
charge: 0.244436 -0.303732 -0.739426 -0.705987 -0.706031 0.364390 -0.787944 -0.799080 0.204350 0.214053 0.208832 0.214029 0.214584 0.217921 0.202960 0.214630 0.202949 0.217909 0.213662 0.213693 0.227981 0.228245 0.218744 0.218832
chargesum: 0.00000
title: Mulliken charges with hydrogens summed into heavy atoms:
elementType: C C C C C C C C
charge: 0.244436 -0.099382 -0.102512 -0.070522 -0.070543 0.364390 -0.132608 -0.133259
polarizability: 1.08837707e+02 -4.27278299e+00 8.26305792e+01 1.79638424e-03 -2.49838632e-03 7.24052400e+01
1716.lowfreq: -0.0005 -0.0004 0.0007 11.9999 14.3269 25.4511 54.8508 115.6774 146.3579
frequency: 53.7992 115.6630 146.3503 187.4313 187.7217 221.5327 238.5995 277.0469 296.2751 316.6561 339.4993 369.3789 410.6788 431.1031 493.5554 548.5134 752.0485 813.2051 832.2852 918.3917 924.9681 935.4688 939.8010 946.5279 993.5156 1023.4324 1024.0509 1074.6768 1081.9731 1167.0103 1207.5420 1239.5195 1258.7440 1364.4421 1365.7984 1374.9236 1387.4980 1398.4223 1403.2618 1451.9900 1459.2988 1460.3065 1464.9313 1467.6842 1471.0028 1476.4740 1483.0017 1486.9857 1495.5150 1682.8145 2955.1126 2964.6418 2965.6833 2969.7712 2974.5590 3024.7456 3028.6094 3057.7010 3059.8816 3064.0552 3065.2534 3072.0105 3079.3874 3082.7215 3085.9787 3124.8366
redmass: 1.6689 1.8753 1.2491 2.3702 1.0775 1.2395 1.0772 1.0767 2.6150 2.5742 2.3525 2.3184 2.3667 2.2538 2.0881 2.7565 3.7444 3.2382 1.4066 1.6745 1.7206 1.7306 1.1982 1.5799 1.2441 1.3796 1.4184 1.5473 1.6613 2.2465 3.0435 3.2249 3.1539 1.2367 1.2302 1.1886 1.3443 1.2386 1.2013 1.0511 1.0593 1.0493 1.0483 1.0472 1.0670 1.0485 1.0642 1.0505 1.0630 6.7872 1.0376 1.0407 1.0345 1.0361 1.0368 1.0970 1.0962 1.0918 1.0993 1.0970 1.0998 1.0982 1.0971 1.0988 1.0982 1.0925
irintensity: 0.2401 0.7530 0.4743 0.0357 0.0024 0.3073 0.0789 0.0268 0.0224 0.0036 1.7354 0.7314 3.2575 0.7842 3.2435 0.6734 0.2697 2.3336 17.4095 0.5549 5.2334 4.0364 0.0040 0.1547 4.0740 0.1434 3.7929 25.6920 3.8495 6.2297 12.5412 11.2688 12.2290 1.6398 16.5363 23.2073 28.6853 13.4188 2.7036 0.0018 6.4690 9.9254 3.7131 0.1649 19.7843 0.2047 11.6881 23.7011 10.4582 6.8886 44.8282 54.5187 36.1759 38.0211 33.2766 4.2037 50.6500 12.4095 5.9927 10.6449 45.7266 106.4672 31.1824 13.7452 82.2692 28.7333
temp: 298.150 k
press: 1.00000 atm
elementType: 6 6 6 6 6 6 6 6 1 1 1 1 1 1 1 1 1 1 1 1 1 1 1 1
symmnumber: 1
zpe: 568443.1 jmol-1
zpe.correction: 0.216509 hartree
zpe.thermalcorrener: 0.227505 hartree
zpe.thermalcorrenthalpy: 0.228449 hartree
zpe.thermalcorrgfe: 0.181256 hartree
zpe.sumelectzpe: -313.760884 hartree
zpe.sumelectthermal: -313.749888 hartree
zpe.sumelectthermalent: -313.748944 hartree
zpe.sumelectthermalfe: -313.796136 hartree
dipole: -0.3217 0.2031 -0.0004
dipole: 0.3805
quadrupole: -50.5691 -51.9329 -54.0311
quadrupole: -0.3775 0.0007 -0.0005
quadrupole: 1.6086 0.2448 -1.8534 -0.3775 0.0007 -0.0005
hfenergy: -313.9773926 hartree
pointgroup: C01 [X(C8H16)]
dipole: -0.1239754 0.0839023 -0.0001447 debye
dipolederiv: 0.1993406 -0.0705104 -0.0000406 -0.0802465 0.094526 -0.000146 -0.0002698 -0.0000911 0.1847302 -0.032638 0.0582889 0.0001865 0.2408933 -0.0013882 0.0005018 0.0004926 0.00025 -0.3111191 0.0156829 0.0644634 0.0001104 0.0434964 -0.0229466 -0.0001987 0.000063 -0.0001649 0.0540918 -0.019727 0.0205307 -0.0120577 -0.00884 0.0076597 -0.0552288 0.0165095 -0.0518435 -0.0328338 -0.01967 0.0204932 0.0120528 -0.008703 0.007185 0.0553459 -0.0164452 0.0519824 -0.0324721 0.2333131 0.0152141 0.0002103 -0.0546217 0.2685191 0.000108 0.0003406 0.0000482 -0.1339891 -0.0715218 -0.0881803 -0.000124 -0.0210744 -0.0310845 -0.0001431 -0.0000592 -0.00008 0.1066941 -0.016662 0.007427 -0.0001227 -0.0074066 -0.1665239 -0.0001588 -0.0003472 0.0000074 0.0983732 0.0228299 -0.0128442 -0.0000549 -0.0453763 -0.173602 -0.0002719 -0.0000763 -0.0002761 0.149789 0.0896855 -0.0261118 -0.0451932 0.0094697 -0.0174352 -0.1114475 -0.012252 -0.1451173 -0.0927473 -0.1895026 -0.040784 -0.0001228 -0.1173877 0.0478058 -0.0000953 -0.0002633 -0.0000715 0.0925422 0.0896397 -0.0263238 0.045163 0.0094101 -0.0184366 0.1117525 0.0123201 0.1454065 -0.0917649 0.0143815 0.1358763 0.0268547 0.1242278 -0.0967058 -0.0384687 0.019084 -0.0059503 0.0683011 0.095078 -0.0267456 0.0327909 0.0003589 0.004603 0.1355649 0.024949 0.0769797 -0.1107494 -0.2026644 -0.1022395 -0.0379488 -0.1062639 0.0601535 -0.0239371 -0.0083884 -0.0042526 0.0693972 0.0145763 0.1359448 -0.0264148 0.124274 -0.0968811 0.0378837 -0.0186945 0.0054031 0.0683974 -0.2026992 -0.1023646 0.0375118 -0.1061959 0.060077 0.0238281 0.0079018 0.0042045 0.0695511 0.0950776 -0.0266207 -0.0328998 0.000462 0.0053851 -0.135082 -0.024896 -0.0765569 -0.1115623 -0.0660115 0.0014753 -0.0975818 0.0151684 0.0740863 0.0718511 -0.1670534 0.0332649 -0.0659045 -0.0661801 0.0012334 0.0975569 0.0148697 0.074259 -0.07153 0.1670485 -0.0329599 -0.0659538 0.0740243 0.0842397 0.0000817 -0.0134703 -0.1617595 -0.0003022 -0.000017 -0.0002339 0.1001846 -0.0540446 -0.1445292 -0.0005518 -0.1268684 -0.007555 -0.0002891 -0.000486 -0.0003649 0.0992976 -0.0018098 0.0611265 0.1124542 0.0567207 0.0452503 -0.0168693 0.1462415 -0.081318 -0.0557237 -0.0004985 0.060941 -0.1118602 0.0571038 0.0448088 0.0173325 -0.1457022 0.0817343 -0.0565297 unknown
polarizability: 108.5397373|-5.0967355|82.9285421|0.0133693|0.003058|72.4052468 unknown
InChI: InChI=1S/C8H16/c1-7(2)6-8(3,4)5/h6H,1-5H3
charge 0 multiplicity 1
24 atoms
C  1.176952 -0.069237 0.000482
C  -0.24752 -0.656866 -0.000598
C  2.178554 -1.259968 -0.001674
C  1.445113 0.779251 1.279369
C  1.445315 0.783894 -1.27523
C  -1.466918 -0.042768 -0.000591
C  -2.741697 -0.876858 -0.001837
C  -1.722975 1.456308 0.000375
H  -0.269999 -1.759215 -0.001544
H  2.037605 -1.892503 -0.898331
H  3.222592 -0.894964 -0.000891
H  2.03747 -1.895946 0.892527
H  0.78531 1.661863 1.340623
H  1.279967 0.172834 2.188857
H  2.492979 1.137722 1.289114
H  0.785653 1.666822 -1.333353
H  2.493226 1.142266 -1.283527
H  1.280206 0.180848 -2.186965
H  -3.365157 -0.650259 -0.890363
H  -3.365587 -0.652215 0.886879
H  -2.525471 -1.959392 -0.002993
H  -0.805065 2.060908 0.003203
H  -2.323521 1.74327 0.88697
H  -2.319235 1.745206 -0.888501
