program: Gaussian 09
title: 000089980
version: EM64L-G09RevD.01
frameworkgroup: C1[X(C8H19O6PS)]
method: RPBEPBE
basis: SDD
operation: Freq
keyword: #p
keyword: freq=noraman
keyword: PBEPBE/SDD
title: #p freq=noraman PBEPBE/SDD
converged: YES YES NO NO
title: Mulliken charges:
elementType: S P O O O O O O C C C C C C C C H H H H H H H H H H H H H H H H H H H
charge: 0.943617 1.419316 -0.525735 -0.575403 -0.562517 -0.525790 -0.509980 -0.607529 -0.547222 -0.509608 -0.231513 -0.636469 -0.212414 -0.236331 -0.657671 -0.668694 0.247237 0.291539 0.254798 0.261820 0.274620 0.248471 0.232193 0.254704 0.261365 0.224677 0.228255 0.261370 0.227707 0.207903 0.234539 0.235754 0.203330 0.271275 0.222386
chargesum: 0.00000
title: Mulliken charges with hydrogens summed into heavy atoms:
elementType: S P O O O O O O C C C C C C C C
charge: 0.943617 1.419316 -0.525735 -0.575403 -0.562517 -0.525790 -0.509980 -0.607529 -0.008446 0.007009 0.291578 0.111794 0.240518 0.252746 0.020524 0.028297
polarizability: 1.89110509e+02 7.83477295e+00 1.49281304e+02 3.10235204e+00 5.78755120e+00 1.43995011e+02
1716.lowfreq: -8.0593 -4.8181 0.0018 0.0024 0.0028 8.7183 18.6822 28.8531 33.3895
frequency: 18.4619 28.5907 33.1725 39.2187 41.3572 51.0664 62.2121 74.5208 95.4977 112.5067 120.2677 140.4514 152.9997 191.2734 195.9516 222.7927 232.2382 245.7389 252.0653 268.9527 278.6523 284.0082 290.8476 293.9078 317.1516 326.2003 379.2455 418.2333 448.5212 464.7469 520.5288 551.3133 609.1991 678.2403 708.9896 782.2682 789.9657 810.1263 818.9459 846.6496 872.9207 885.0637 898.7361 933.7223 966.4970 978.6393 1002.6887 1022.8501 1040.1517 1058.0521 1066.4144 1075.3637 1106.9842 1109.5783 1132.9019 1137.6954 1152.2231 1198.6440 1240.3944 1242.3526 1251.7862 1259.9168 1262.9465 1354.1902 1359.2462 1372.9571 1389.6145 1394.4569 1396.1989 1396.6060 1412.3655 1453.7394 1456.9478 1460.8302 1461.8927 1478.3742 1480.8872 1483.3398 1488.7680 1489.6460 2977.7012 2989.7334 2991.5096 2994.7627 2996.4881 3006.0333 3036.3299 3037.9424 3048.5689 3056.4409 3076.7167 3086.2162 3089.6326 3092.1601 3103.1658 3111.3883 3113.6487 3132.7078 3146.6426
redmass: 3.6193 2.5968 5.2466 2.5266 4.5419 3.2540 3.5380 3.2018 4.0826 4.0389 4.9747 3.2546 4.4382 1.7187 2.5145 3.9741 1.3487 1.6494 1.6596 3.9041 2.6643 3.6848 3.9012 3.8428 4.7245 5.4183 4.6800 4.5787 5.6184 6.2913 4.6646 10.4522 4.8313 5.6774 5.6392 1.3332 5.5713 1.0862 1.1263 2.4182 4.6067 4.4711 4.1752 1.7467 1.7946 1.7406 2.2466 2.6468 1.5769 5.0248 3.3391 2.9623 2.2366 2.3606 1.4102 1.4078 1.2578 1.2641 1.2461 1.1947 1.1530 1.1688 1.2016 1.2545 1.2337 1.2386 1.1428 1.2468 1.1827 1.2214 1.1229 1.0670 1.0399 1.0405 1.0347 1.0510 1.0538 1.0515 1.0828 1.0770 1.0567 1.0358 1.0499 1.0360 1.0421 1.0580 1.0656 1.0813 1.0716 1.1086 1.1083 1.0974 1.0981 1.0980 1.1023 1.1024 1.1040 1.1094 1.1092
irintensity: 0.3997 0.5887 4.2836 5.1296 1.9883 0.4095 3.3574 0.7068 5.0982 0.8627 0.6543 4.8629 1.0049 1.7651 1.7830 47.2617 1.6910 0.4199 2.1554 9.0611 4.4485 14.6444 7.5293 2.3388 11.2460 40.5237 6.6311 6.7296 12.0394 24.6061 14.7600 75.3927 10.2787 156.6302 73.0865 7.5197 61.8838 3.4880 8.7696 23.6036 97.9183 281.2902 77.4070 75.7842 103.2445 13.8820 113.5864 107.9337 26.9490 61.7301 60.9032 54.8417 12.0343 20.9774 4.0180 12.6494 3.6542 3.8237 0.7087 21.5581 0.3215 1.0829 3.7592 5.4332 3.1407 4.7318 17.0595 25.3506 10.8536 51.4752 2.8531 26.6612 12.5836 9.1452 18.3547 6.4211 15.2885 8.4549 9.0448 12.6236 21.3923 23.2152 22.7221 15.2224 26.6626 25.6958 8.2893 0.9606 15.9742 13.8524 7.2463 22.9148 7.4180 28.7460 2.4049 33.6316 19.2249 8.6139 2.1890
temp: 298.150 k
press: 1.00000 atm
elementType: 16 15 8 8 8 8 8 8 6 6 6 6 6 6 6 6 1 1 1 1 1 1 1 1 1 1 1 1 1 1 1 1 1 1 1
symmnumber: 1
zpe: 720818.5 jmol-1
zpe.correction: 0.274545 hartree
zpe.thermalcorrener: 0.296870 hartree
zpe.thermalcorrenthalpy: 0.297814 hartree
zpe.thermalcorrgfe: 0.219772 hartree
zpe.sumelectzpe: -1505.372067 hartree
zpe.sumelectthermal: -1505.349743 hartree
zpe.sumelectthermalent: -1505.348798 hartree
zpe.sumelectthermalfe: -1505.426840 hartree
dipole: 4.7510 -5.5918 2.2164
dipole: 7.6650
quadrupole: -92.0329 -102.6053 -123.6220
quadrupole: -5.4137 -12.4814 5.9747
quadrupole: 14.0538 3.4815 -17.5352 -5.4137 -12.4814 5.9747
hfenergy: -1505.6466122 hartree
pointgroup: C01 [X(C8H19O6P1S1)]
dipole: 2.2404674 -1.9906948 -0.3340632 debye
polarizability: 185.7592436|12.0926827|145.5492907|7.0809869|6.4332963|151.0782895 unknown
InChI: InChI=1S/C8H19O6PS/c1-4-12-15(9,13-5-2)14-7-8-16(10,11)6-3/h4-8H2,1-3H3
charge 0 multiplicity 1
35 atoms
S  2.488121 0.065247 -0.019679
P  -2.039377 0.265225 -0.681352
O  -0.561498 -0.673717 -0.815404
O  2.201752 1.64494 -0.368554
O  2.031909 -0.552567 1.426415
O  -2.875873 -0.74029 0.432843
O  -1.655151 1.615158 0.272862
O  -2.706586 0.606663 -2.076941
C  1.704635 -0.973238 -1.495699
C  4.409779 -0.22718 -0.191366
C  0.391442 -0.326263 -1.886484
C  5.095433 0.405922 1.015082
C  -3.379849 -2.06965 -0.029905
C  -0.982682 1.450174 1.618066
C  -4.142845 -2.663137 1.149398
C  -0.258342 2.764407 1.879612
H  2.456295 -0.92348 -2.301426
H  1.589616 -1.987521 -1.084965
H  4.515699 -1.323956 -0.236384
H  4.65925 0.245815 -1.154894
H  0.511258 0.772472 -1.977554
H  0.037626 -0.732139 -2.854009
H  6.183976 0.222715 0.955508
H  4.929424 1.496329 1.041846
H  4.721137 -0.033025 1.955874
H  -2.512491 -2.693698 -0.316275
H  -4.032109 -1.917709 -0.910649
H  -0.278504 0.598195 1.581652
H  -1.78441 1.245547 2.348845
H  -4.543485 -3.656932 0.875633
H  -3.478093 -2.780965 2.021746
H  -4.985366 -2.011279 1.435227
H  0.193278 2.736589 2.889414
H  0.546762 2.9062 1.139865
H  -0.959131 3.615548 1.832152
