program: Gaussian 09
title: 000001957
version: EM64L-G09RevD.01
frameworkgroup: C1[X(C21H27N5O2)]
method: RPBEPBE
basis: SDD
operation: Freq
keyword: #p
keyword: freq=noraman
keyword: PBEPBE/SDD
title: #p freq=noraman PBEPBE/SDD
converged: YES YES NO NO
title: Mulliken charges:
elementType: O O N N N N N C C C C C C C C C C C C C C C C C C C C C H H H H H H H H H H H H H H H H H H H H H H H H H H H
charge: -0.377304 -0.261065 -0.155045 -0.348353 -0.577865 -0.448315 -0.033594 -0.235354 -0.488748 -0.483113 -0.392220 0.271840 0.223836 -0.208135 -0.621496 -0.415166 0.500248 -0.348769 -0.350333 -0.432855 -0.237622 -0.231649 -0.248436 0.462221 -0.309201 -0.355274 -0.341702 -0.323494 0.288753 0.263635 0.224192 0.231105 0.270075 0.234486 0.280417 0.254756 0.252954 0.211808 0.345518 0.245851 0.234170 0.266933 0.300200 0.221965 0.226609 0.234583 0.233483 0.344115 0.234076 0.226800 0.231146 0.221244 0.226844 0.229687 0.231556
chargesum: 0.00000
title: Mulliken charges with hydrogens summed into heavy atoms:
elementType: O O N N N N N C C C C C C C C C C C C C C C C C C C C C
charge: -0.377304 -0.261065 -0.155045 -0.002835 -0.010731 -0.104199 -0.033594 0.053399 -0.000922 0.018067 0.122682 0.271840 0.223836 0.046621 -0.156734 0.064856 0.500248 0.099805 -0.115750 -0.199372 -0.003546 -0.004849 -0.017290 0.462221 -0.087957 -0.128430 -0.112015 -0.091937
polarizability: 2.86749080e+02 8.07011866e+00 2.35175015e+02 1.83300269e+01 1.55296267e+01 2.50215055e+02
1716.lowfreq: -9.4736 -3.9713 -0.5594 0.0002 0.0003 0.0005 8.8951 20.5594 29.5431
frequency: 8.7834 20.5178 29.3927 38.5262 40.3402 45.8179 56.8518 65.2713 74.7732 90.0777 107.3552 120.0508 149.1985 162.1861 176.4807 184.6793 195.5900 225.9493 240.5485 263.4279 271.9163 285.8902 296.3554 313.6317 333.7813 345.1386 362.7643 370.6103 381.8813 403.4199 409.7363 421.3698 493.3622 495.9546 512.2259 527.9197 572.6956 580.4007 591.8417 608.9185 617.3620 649.1052 652.9995 659.4309 676.7574 703.1234 706.7230 716.4744 734.4823 735.7749 759.2351 776.0650 811.9735 816.9634 820.6767 837.7313 846.6702 853.7874 866.5392 885.7741 896.1520 914.9572 924.8120 933.0432 940.4735 941.4738 952.8261 959.7685 961.1464 976.2993 982.4907 990.1738 996.5330 1004.1129 1025.9166 1049.0638 1065.3633 1075.1131 1080.4604 1087.8906 1091.4123 1106.8284 1110.9051 1125.3258 1127.5755 1139.9807 1171.3877 1172.3356 1177.0790 1185.1838 1186.5183 1215.6898 1220.3056 1226.6185 1243.3841 1246.5705 1269.7754 1285.4514 1285.9410 1294.8018 1307.1196 1308.7291 1322.1246 1328.3207 1330.9371 1334.8004 1337.9711 1345.3569 1350.0222 1358.6453 1365.2406 1380.0309 1417.9930 1422.5898 1440.3550 1445.8348 1457.1157 1464.8310 1468.8218 1473.4306 1481.0502 1483.3265 1485.8680 1502.5986 1531.7411 1542.0635 1578.6789 1589.0713 1604.4049 1611.2767 1621.4992 1638.1738 2936.4235 2984.4405 2990.0427 3011.4553 3013.6156 3016.7667 3025.9607 3033.6541 3034.7924 3056.6036 3088.5612 3091.5053 3099.1793 3110.7598 3111.9301 3114.7664 3120.7503 3127.1255 3136.4071 3139.6384 3147.8430 3163.5152 3165.2193 3390.4721 3423.3135 3456.7138 3593.2903
redmass: 6.0325 4.9368 5.4564 5.0010 4.5457 5.0865 4.2985 5.5443 5.3313 4.0069 5.7770 3.1961 3.2042 4.3508 3.3500 3.6639 4.7781 4.8031 3.9243 2.7537 2.8297 4.1417 1.2386 3.3399 2.9447 3.8565 3.1028 3.0108 2.6380 2.8124 4.2485 3.9535 4.0084 3.3847 3.8328 2.7140 2.7118 3.1976 2.8383 1.7225 6.0949 1.3174 2.6801 5.8474 4.2387 2.3390 2.2266 3.2682 2.8045 1.7011 2.0311 1.9940 1.6504 4.4746 4.1235 2.4692 1.3772 1.2601 2.0789 2.8914 1.7709 1.7445 2.0459 2.5082 2.1983 1.4196 6.0396 1.5680 2.2050 1.3925 3.8709 5.9260 1.3561 2.1733 2.2002 2.0928 2.2246 1.5682 1.7633 1.7737 2.1118 2.5554 2.0513 3.0457 2.8810 1.3912 1.2809 1.0746 1.3915 1.5903 1.1545 2.7132 1.2443 1.3369 1.6253 1.2801 1.3647 1.4764 1.4045 1.7531 1.2853 1.3292 1.3942 1.2430 1.4032 1.4501 1.6157 1.7808 1.8609 1.5462 1.3782 7.9105 2.4615 3.6168 2.1510 1.1058 1.0930 1.3408 1.4839 1.0959 1.8628 1.1400 1.2158 2.7285 4.3718 1.8799 2.1576 5.9836 5.1483 6.0637 1.2555 4.3251 1.0683 1.0666 1.0602 1.0737 1.0856 1.0664 1.0760 1.0618 1.0862 1.1025 1.0977 1.1043 1.1008 1.1046 1.0877 1.0867 1.0892 1.0859 1.0911 1.0975 1.0957 1.0947 1.1013 1.0795 1.0791 1.0446 1.0982
irintensity: 0.7270 0.9170 0.5405 0.0610 0.6237 5.8763 2.2266 0.5004 1.8010 1.4265 12.0531 3.6235 3.0588 0.3285 0.7380 2.9426 2.0932 3.2114 9.1220 5.3901 13.4614 2.1652 64.0177 10.2225 8.0323 7.9584 1.5160 2.4234 0.1366 0.0438 2.1487 8.6665 2.2539 5.6750 9.1630 27.4609 6.2042 72.4561 5.8265 261.6700 2.7644 121.3188 2.3713 5.8850 8.4201 20.2143 105.4907 11.5953 20.6835 83.6101 43.0391 10.4479 92.8008 2.8054 24.6842 2.6774 23.3222 0.0993 6.0770 4.5590 9.2050 10.5823 1.7164 1.8304 16.4225 7.5283 24.8306 1.3589 3.2576 0.1365 19.1433 0.1183 0.6624 11.3042 4.5204 0.1455 9.7583 8.3048 3.0977 1.4590 2.5392 7.6930 5.7218 14.3861 13.4668 4.9839 6.6978 1.2845 3.9492 8.0393 6.1241 0.2841 0.8969 83.5735 16.3467 10.1068 11.2479 6.1668 3.0326 5.3429 4.3193 3.6436 8.6944 1.1700 2.9446 2.5487 9.7850 33.9372 31.6850 24.5361 2.1343 2.0659 2.5308 40.0580 4.5313 39.2176 14.6518 2.9556 16.1536 36.7139 17.5024 6.4377 47.3570 154.9245 474.6728 71.0588 28.9233 2.1674 341.2650 7.0964 91.8727 120.5579 50.5906 29.2235 24.4333 8.7834 30.5765 12.3385 39.9720 24.8156 66.0357 13.8861 8.8843 8.6733 11.4522 18.2715 7.2096 14.0820 32.7793 1.9159 9.0709 28.6692 36.2592 14.1579 16.8889 95.5063 273.5905 9.3511 9.1125
temp: 298.150 k
press: 1.00000 atm
elementType: 8 8 7 7 7 7 7 6 6 6 6 6 6 6 6 6 6 6 6 6 6 6 6 6 6 6 6 6 1 1 1 1 1 1 1 1 1 1 1 1 1 1 1 1 1 1 1 1 1 1 1 1 1 1 1
symmnumber: 1
zpe: 1199610.4 jmol-1
zpe.correction: 0.456907 hartree
zpe.thermalcorrener: 0.483273 hartree
zpe.thermalcorrenthalpy: 0.484217 hartree
zpe.thermalcorrgfe: 0.397117 hartree
zpe.sumelectzpe: -1238.596706 hartree
zpe.sumelectthermal: -1238.570340 hartree
zpe.sumelectthermalent: -1238.569396 hartree
zpe.sumelectthermalfe: -1238.656496 hartree
dipole: -6.0118 -0.1733 0.8214
dipole: 6.0701
quadrupole: -189.1397 -157.9329 -163.9340
quadrupole: -15.5080 -5.8593 3.2849
quadrupole: -18.8041 12.4026 6.4015 -15.5080 -5.8593 3.2849
hfenergy: -1239.053613 hartree
pointgroup: C01 [X(C21H27N5O2)]
dipole: -2.0426099 -1.2332075 0.1015866 debye
polarizability: 268.8458215|23.9858958|243.943874|13.986475|20.4175169|259.3494539 unknown
InChI: InChI=1S/C21H27N5O2/c22-18(15-16-5-2-1-3-6-16)21(28)26-14-4-7-19(26)20(27)25-13-12-24-17-8-10-23-11-9-17/h1-3,5-6,8-11,18-19,24-25H,4,7,12-15,22H2
charge 0 multiplicity 1
55 atoms
O  0.286017 -1.51002 1.714099
O  -0.729532 -2.793292 -2.315701
N  -1.787203 -1.838692 0.720538
N  0.93933 -2.803431 -0.674817
N  -0.950293 -0.008233 3.655748
N  2.43218 -0.349074 -0.270717
N  4.496527 3.251878 0.756953
C  -1.369261 -3.127981 0.069052
C  -2.700743 -3.734266 -0.42494
C  -3.5922 -2.497023 -0.69513
C  -3.224411 -1.521676 0.443316
C  -0.942576 -1.143508 1.536501
C  -0.367058 -2.882204 -1.102584
C  -1.451556 0.107236 2.278452
C  -0.98055 1.424111 1.534954
C  2.060552 -2.448596 -1.554823
C  -1.670744 1.660004 0.203123
C  2.309475 -0.92051 -1.616186
C  -1.12301 1.154552 -1.004773
C  -2.914725 2.343248 0.147103
C  -1.806124 1.307818 -2.231671
C  -3.599856 2.504739 -1.078619
C  -3.049816 1.981049 -2.27247
C  3.10126 0.830338 0.029212
C  3.780206 1.623564 -0.945041
C  3.138073 1.301979 1.380245
C  4.448416 2.79424 -0.530959
C  3.832142 2.48562 1.681243
H  -0.869477 -3.752039 0.832995
H  -2.548281 -4.337611 -1.333006
H  -3.138929 -4.371397 0.364715
H  -4.668718 -2.734887 -0.697691
H  -3.320872 -2.059036 -1.670094
H  -3.828073 -1.712785 1.352452
H  -3.341184 -0.467591 0.147798
H  -2.55666 0.114525 2.299565
H  0.118197 1.378584 1.418872
H  -1.203767 2.257198 2.229491
H  1.060959 -2.72588 0.345952
H  1.831458 -2.816728 -2.569396
H  2.967132 -2.957844 -1.181986
H  -1.122934 0.813176 4.241244
H  0.015083 -0.352427 3.697596
H  3.248514 -0.752991 -2.175986
H  1.490694 -0.44267 -2.197472
H  -0.15244 0.645487 -0.978556
H  -3.342203 2.759848 1.068332
H  1.832406 -0.740965 0.467026
H  -1.37091 0.902369 -3.151646
H  -4.555094 3.041441 -1.104718
H  -3.579326 2.103571 -3.223809
H  3.781977 1.353244 -2.004852
H  2.643644 0.732108 2.176086
H  4.97361 3.409901 -1.27151
H  3.870171 2.85173 2.714291
