program: Gaussian 09
title: 000089938
version: EM64L-G09RevD.01
frameworkgroup: C1[X(C11H12O5)]
method: RPBEPBE
basis: SDD
operation: Freq
keyword: #pfreq=noraman
keyword: PBEPBE/SDD
title: #p freq=noraman PBEPBE/SDD
converged: YES YES NO NO
title: Mulliken charges:
elementType: O O O O O C C C C C C C C C C C H H H H H H H H H H H H
charge: -0.214502 -0.292858 -0.294499 -0.219891 -0.251547 0.147529 0.213172 0.263762 -0.435060 -0.339050 -0.338692 0.164947 0.161735 -0.538613 -0.498995 -0.500026 0.313650 0.246924 0.273807 0.226213 0.224577 0.258696 0.239711 0.240612 0.232861 0.230258 0.242723 0.242554
chargesum: 0.00000
title: Mulliken charges with hydrogens summed into heavy atoms:
elementType: O O O O O C C C C C C C C C C C
charge: -0.214502 -0.292858 -0.294499 -0.219891 -0.251547 0.147529 0.213172 0.263762 -0.121410 -0.092125 -0.064885 0.164947 0.161735 0.170873 0.214189 0.215509
polarizability: 2.06797897e+02 -8.36189366e+00 1.65370233e+02 1.33139855e+00 1.41275297e-02 6.99011672e+01
1716.lowfreq: -0.0010 -0.0008 0.0002 3.9198 5.8844 7.8396 22.7314 49.1718 66.6601
frequency: 22.6826 49.1459 66.6530 92.3913 96.6690 101.7797 113.7407 126.9768 144.2616 157.8091 197.7904 221.4509 232.6989 268.9183 294.9085 318.3443 324.3686 347.3859 370.5857 450.0402 472.2729 529.3482 569.5271 614.7792 659.8196 674.3944 734.8987 738.4772 749.5427 776.6051 823.6875 833.9626 913.3091 961.6620 975.3394 976.7952 985.7665 1040.5312 1085.7911 1108.7933 1113.7929 1114.9507 1141.1946 1144.8159 1149.1341 1161.9773 1198.1360 1240.2816 1250.9411 1290.2329 1386.6721 1407.0274 1422.6682 1426.2659 1436.7296 1451.4621 1452.0862 1464.7474 1464.9994 1465.7903 1472.3151 1489.9482 1570.7989 1607.4485 1627.3128 1638.7772 2969.1778 3000.6654 3002.9092 3062.9698 3100.3083 3103.6350 3137.6441 3145.4353 3146.2293 3162.7376 3182.2921 3186.3488
redmass: 7.0923 5.7591 3.5853 3.6373 3.2299 1.2050 1.2128 2.8456 3.5409 3.5632 4.6859 4.1341 1.1811 5.5634 5.3614 4.4928 5.1517 5.4093 7.2834 3.8789 7.2050 3.8213 4.6882 6.2691 6.8893 6.5503 5.8062 5.7805 6.0052 4.0792 7.0320 1.6238 8.1079 6.6062 7.3714 1.4911 1.3729 5.3878 4.0170 1.2582 1.2653 1.2639 1.3829 1.4996 1.4816 1.5553 2.3670 2.3386 3.7427 1.8362 5.5832 4.1438 1.1858 1.2617 1.2431 1.0501 1.0495 1.0584 1.0589 1.0953 1.0501 2.4202 8.4405 6.9676 10.1940 9.5105 1.0327 1.0297 1.0296 1.1045 1.1042 1.1044 1.0999 1.1044 1.1046 1.0875 1.0956 1.0928
irintensity: 2.6082 2.6770 0.8965 1.8433 5.2171 0.1270 0.5290 0.2359 3.1211 2.0710 11.4869 3.0445 0.1100 13.4356 9.3569 14.5464 1.5020 6.0194 5.2533 0.1869 0.9529 5.1369 1.1570 19.1652 19.9933 24.1814 11.1819 6.3779 0.9199 8.2578 19.1102 38.6196 4.2968 57.6345 40.2053 7.7747 4.7966 207.1715 140.9185 0.1628 0.2834 0.0477 36.2925 125.9620 48.3585 74.8995 405.8450 22.4116 310.7686 61.6473 5.7803 3.0885 32.3313 35.6585 7.2193 14.1802 13.4607 30.6487 17.2447 39.7828 15.2183 74.7660 27.0250 42.5509 287.5901 280.7382 64.0586 43.8026 43.4414 39.6782 28.2834 27.8249 15.1876 14.8490 17.3034 4.1818 3.0654 6.9406
temp: 298.150 k
press: 1.00000 atm
elementType: 8 8 8 8 8 6 6 6 6 6 6 6 6 6 6 6 1 1 1 1 1 1 1 1 1 1 1 1
symmnumber: 1
zpe: 556351.8 jmol-1
zpe.correction: 0.211903 hartree
zpe.thermalcorrener: 0.228528 hartree
zpe.thermalcorrenthalpy: 0.229472 hartree
zpe.thermalcorrgfe: 0.166182 hartree
zpe.sumelectzpe: -801.288607 hartree
zpe.sumelectthermal: -801.271982 hartree
zpe.sumelectthermalent: -801.271038 hartree
zpe.sumelectthermalfe: -801.334328 hartree
dipole: 1.1847 3.3710 0.4428
dipole: 3.6005
quadrupole: -85.1682 -74.1287 -93.6550
quadrupole: 4.1648 -2.2074 0.3815
quadrupole: -0.8509 10.1886 -9.3377 4.1648 -2.2074 0.3815
hfenergy: -801.5005097 hartree
pointgroup: C01 [X(C11H12O5)]
dipole: -0.4866878 1.3208025 -0.1588053 debye
polarizability: 206.4150456|9.0251831|165.6440656|3.616889|1.8193765|70.0101863 unknown
InChI: InChI=1S/C11H12O5/c1-14-9-5-4-7(10(12)15-2)6-8(9)11(13)16-3/h4-6H,1-3H3
charge 0 multiplicity 1
28 atoms
O  2.402299 1.896845 -0.071155
O  1.901987 -2.291683 -0.309654
O  -3.81378 0.324926 -0.151876
O  3.413549 -0.634345 0.307821
O  -2.914628 -1.82638 -0.127065
C  1.03234 -0.086408 -0.054927
C  1.131334 1.347037 -0.063552
C  -1.429613 0.112691 -0.105885
C  -0.253691 -0.672191 -0.084327
C  -0.052557 2.135843 -0.084864
C  -1.316758 1.526057 -0.103219
C  2.242483 -0.960969 0.008187
C  -2.742915 -0.581939 -0.128305
C  2.537825 3.360003 -0.08554
C  3.018486 -3.258328 -0.234852
C  -5.15991 -0.289951 -0.175994
H  -0.341398 -1.761415 -0.086562
H  0.014063 3.226857 -0.089877
H  -2.225096 2.13455 -0.117518
H  2.083572 3.812665 0.815976
H  2.086764 3.796355 -0.99701
H  3.622758 3.534485 -0.084261
H  3.42974 -3.293833 0.788473
H  3.822185 -2.971405 -0.934032
H  2.572657 -4.2226 -0.516785
H  -5.857298 0.559545 -0.186026
H  -5.310483 -0.918384 0.718006
H  -5.279917 -0.914027 -1.077677
