program: Gaussian 09
title: 000089914
version: EM64L-G09RevD.01
frameworkgroup: C1[X(C25H21N)]
method: RPBEPBE
basis: SDD
operation: Freq
keyword: #pfreq=noraman
keyword: PBEPBE/SDD
title: #p freq=noraman PBEPBE/SDD
converged: YES YES NO NO
title: Mulliken charges:
elementType: N C C C C C C C C C C C C C C C C C C C C C C C C C H H H H H H H H H H H H H H H H H H H H H
charge: -0.699349 0.071166 0.338433 0.317070 0.312442 0.312754 -0.355298 -0.359434 -0.370821 -0.367573 -0.371493 -0.366913 -0.372296 -0.368697 -0.469190 -0.468957 -0.263845 -0.263239 -0.262775 -0.264337 -0.262652 -0.263108 0.500888 -0.254194 -0.253209 -0.253230 0.243923 0.245513 0.250582 0.250017 0.251450 0.249032 0.255199 0.253791 0.215476 0.215358 0.223094 0.223991 0.223892 0.223189 0.223437 0.223563 0.226028 0.226505 0.226505 0.303641 0.303673
chargesum: 0.00000
title: Mulliken charges with hydrogens summed into heavy atoms:
elementType: N C C C C C C C C C C C C C C C C C C C C C C C C C
charge: -0.092035 0.071166 0.338433 0.317070 0.312442 0.312754 -0.111375 -0.113921 -0.120239 -0.117556 -0.120044 -0.117882 -0.117097 -0.114906 -0.253714 -0.253598 -0.040751 -0.039248 -0.038883 -0.041148 -0.039215 -0.039545 0.500888 -0.028166 -0.026704 -0.026726
polarizability: 2.80942339e+02 -1.82054624e+01 2.65628105e+02 2.47127226e-02 4.43726308e-02 2.67227828e+02
1716.lowfreq: -18.4204 -5.8264 -4.1118 -0.0006 -0.0002 -0.0001 5.4747 46.7479 53.7303
frequency: -17.9145 46.7478 53.6493 61.5599 78.1913 80.8410 90.5855 98.2653 117.7458 172.8927 215.3491 235.0231 243.4882 254.7112 273.2611 280.8394 285.2707 331.3679 338.7492 362.0949 368.7368 395.3685 397.3186 412.8642 414.2405 419.8417 480.4934 486.5618 515.9366 553.2432 580.4715 615.7565 617.7959 619.2375 624.2109 632.3402 644.9776 675.5527 701.4300 706.1427 715.6156 731.0841 752.2239 759.0174 776.3975 817.3694 821.0759 824.6642 851.8055 858.6931 861.2571 886.9312 895.3486 898.0496 933.6485 935.0792 942.1825 953.8159 965.1387 981.3930 985.1937 987.7246 991.3251 992.1115 993.4971 993.6291 993.7724 996.9380 1003.6485 1019.3701 1029.2781 1031.6199 1032.3182 1081.7137 1088.5577 1089.8847 1137.2621 1145.3516 1168.7200 1170.8010 1172.1031 1172.7832 1174.5336 1195.3479 1196.0881 1197.9613 1202.5607 1212.2358 1300.5967 1317.4497 1323.7915 1327.0818 1328.1231 1362.8729 1374.8486 1377.2465 1378.1057 1426.4765 1437.8241 1437.8593 1438.4561 1478.0787 1479.0246 1483.7064 1513.7721 1573.8929 1584.0515 1589.0225 1589.4995 1606.7388 1606.8958 1610.7727 1631.5674 1644.1623 3113.0149 3115.1904 3119.1468 3119.1665 3119.6508 3126.0049 3127.1339 3127.8030 3140.9246 3142.0304 3142.2936 3143.5043 3147.4779 3148.2248 3149.4396 3150.2236 3161.7648 3162.0459 3163.0385 3567.4712 3707.9445
redmass: 3.6535 5.2367 4.8218 5.1015 4.3112 4.4155 4.0374 3.9255 3.9495 4.8365 4.5851 4.9143 4.5980 5.5952 4.4581 5.2023 5.3281 4.2956 1.2414 5.2025 1.0402 2.9256 2.7507 2.9147 2.8975 2.8831 3.4137 3.9890 3.1542 2.7882 4.8492 6.4054 6.0353 6.3456 5.3141 6.3657 6.6273 6.0200 1.8641 1.8511 1.6590 2.7424 1.7592 2.2748 2.1799 1.2614 3.3378 2.2324 1.2516 1.2426 1.2534 2.8900 3.2603 4.2793 1.7581 1.6545 1.6589 1.3764 1.3575 1.3808 1.3673 1.3602 5.7446 5.8737 1.4281 4.2521 1.3527 1.2967 2.9301 1.4678 2.4252 2.2173 2.1738 1.6270 1.6078 1.6508 1.3290 3.1261 2.3556 1.6381 1.0613 1.1694 1.5822 1.1450 1.1228 1.1284 1.1423 3.7385 1.5315 2.8314 1.3214 1.3229 1.3536 3.7907 7.7910 6.1987 7.3792 2.4353 3.1046 2.3382 2.2950 2.1118 2.1292 2.1525 2.8422 6.2845 6.0777 6.0859 6.2915 6.0265 5.9571 5.9911 2.2497 1.7342 1.0879 1.0876 1.0842 1.0842 1.0843 1.0875 1.0877 1.0879 1.0923 1.0920 1.0938 1.0921 1.0953 1.0952 1.0949 1.0949 1.1012 1.1011 1.1009 1.0448 1.1040
irintensity: 0.0035 0.8242 0.1040 0.2480 0.4546 0.3596 0.6595 0.4771 0.0040 3.1245 0.0347 0.9871 0.7113 0.7638 0.3509 0.8152 0.0375 0.2596 259.0050 37.3508 0.3693 1.2668 0.0120 0.0210 0.0176 0.0291 2.6240 3.6088 10.9622 2.2195 33.1454 0.0121 3.4053 0.1747 24.4769 8.1939 3.0867 1.1362 24.2514 67.3933 68.3998 24.7066 46.1937 29.5039 21.8860 0.7279 21.7858 41.7365 0.4321 0.8137 3.5475 5.5241 0.0598 0.0904 0.0014 0.2573 0.2583 1.3258 0.8986 0.7667 1.1098 1.9149 0.2256 1.0105 0.9294 0.2371 0.1536 0.1628 0.4547 2.1220 3.6285 17.6198 7.4747 1.2597 3.8232 10.2872 8.6379 1.2483 3.3902 0.3724 0.0827 0.4775 1.2204 1.5651 0.7587 29.6312 22.5265 22.3976 0.4285 69.2074 1.3913 0.2140 0.5746 1.5766 1.2510 5.8979 0.7925 3.0787 1.2830 14.4236 3.7085 29.5379 28.0348 28.3322 151.2487 4.1618 0.1202 0.6857 0.6080 13.0852 15.4809 5.0263 6.4265 332.8174 8.1236 46.5929 4.5541 4.0278 0.5263 2.3033 4.3126 11.8996 49.5184 48.8176 0.8822 13.2528 4.5762 1.4714 31.9261 52.3634 25.0862 34.0778 7.3535 83.5487 19.2058
temp: 298.150 k
press: 1.00000 atm
elementType: 7 6 6 6 6 6 6 6 6 6 6 6 6 6 6 6 6 6 6 6 6 6 6 6 6 6 1 1 1 1 1 1 1 1 1 1 1 1 1 1 1 1 1 1 1 1 1
symmnumber: 1
zpe: 1000171.9 jmol-1
zpe.correction: 0.380945 hartree
zpe.thermalcorrener: 0.401434 hartree
zpe.thermalcorrenthalpy: 0.402378 hartree
zpe.thermalcorrgfe: 0.332803 hartree
zpe.sumelectzpe: -1018.230159 hartree
zpe.sumelectthermal: -1018.209671 hartree
zpe.sumelectthermalent: -1018.208726 hartree
zpe.sumelectthermalfe: -1018.278302 hartree
dipole: 2.5266 -0.7983 0.0014
dipole: 2.6497
quadrupole: -128.4097 -143.5212 -140.4248
quadrupole: -9.2992 0.0293 0.0423
quadrupole: 9.0422 -6.0693 -2.9729 -9.2992 0.0293 0.0423
hfenergy: -1018.6111045 hartree
pointgroup: C01 [X(C25H21N1)]
dipole: 1.0416175 -0.0417291 0.0066263 debye
polarizability: 289.1185538|-11.8052366|257.451603|0.070893|-0.0839149|267.2281148 unknown
InChI: InChI=1S/C25H21N/c26-24-18-16-23(17-19-24)25(20-10-4-1-5-11-20,21-12-6-2-7-13-21)22-14-8-3-9-15-22/h1-19H,26H2
charge 0 multiplicity 1
47 atoms
N  5.599599 -0.265104 0.036618
C  -0.226145 -0.002885 -0.001375
C  1.319989 -0.195608 0.007764
C  -0.386469 1.549162 0.004983
C  -0.932592 -0.693369 1.207294
C  -0.916178 -0.681718 -1.225998
C  2.054581 -0.174933 1.221719
C  2.070182 -0.197758 -1.196519
C  -0.396132 2.277042 1.22334
C  -2.170796 -0.206713 1.701732
C  -2.130584 -0.173693 -1.756228
C  -0.345477 2.288289 -1.206159
C  -0.446709 -1.919087 1.731575
C  -0.440035 -1.919257 -1.731692
C  3.460713 -0.201728 1.241764
C  3.47673 -0.224612 -1.197584
C  -0.398705 3.688579 1.232287
C  -2.879511 -0.898299 2.707397
C  -2.824716 -0.856674 -2.778143
C  -0.34828 3.699552 -1.202705
C  -1.152148 -2.615171 2.736788
C  -1.130527 -2.606319 -2.753027
C  4.203163 -0.233068 0.027006
C  -0.379894 4.411362 0.018008
C  -2.372267 -2.106721 3.236613
C  -2.326596 -2.076827 -3.288298
H  1.52084 -0.13307 2.177357
H  1.548891 -0.175152 -2.159592
H  -0.396969 1.738968 2.17707
H  -2.591614 0.719697 1.296519
H  -2.544213 0.763078 -1.367926
H  -0.305019 1.75845 -2.163687
H  0.490133 -2.338264 1.349878
H  0.477044 -2.354992 -1.321448
H  3.991158 -0.189705 2.202256
H  4.019705 -0.230955 -2.151111
H  -0.409137 4.223014 2.189322
H  -3.831804 -0.495824 3.071661
H  -3.758651 -0.437694 -3.17028
H  -0.318877 4.242598 -2.154475
H  -0.750522 -3.558702 3.12417
H  -0.736733 -3.55923 -3.125159
H  -0.381134 5.507156 0.022949
H  -2.921616 -2.645923 4.016533
H  -2.864707 -2.608971 -4.080804
H  6.126009 -0.270886 -0.831661
H  6.114418 -0.254136 0.91177
