program: Gaussian 09
title: 000007859
version: EM64L-G09RevD.01
frameworkgroup: C1[X(C3H4O)]
method: RPBEPBE
basis: SDD
operation: Freq
keyword: #p
keyword: freq=noraman
keyword: PBEPBE/SDD
title: #p freq=noraman PBEPBE/SDD
converged: NO YES NO NO
title: Mulliken charges:
elementType: O C C C H H H H
charge: -0.433951 -0.391880 0.173969 -0.442670 0.248286 0.222483 0.345568 0.278195
chargesum: 0.00000
title: Mulliken charges with hydrogens summed into heavy atoms:
elementType: O C C C
charge: -0.088383 0.078889 0.173969 -0.164475
polarizability: 5.00321583e+01 -5.54296053e+00 2.60765192e+01 2.69883606e-02 -1.33959612e+00 2.06116135e+01
1716.lowfreq: -9.2460 -8.3774 -0.0010 -0.0008 -0.0007 23.7180 192.6903 276.9950 350.3017
frequency: 192.6796 276.9863 350.2986 528.7122 629.8858 670.3157 878.7626 968.7186 977.7522 1173.3483 1293.2783 1370.7347 1457.5404 2138.1491 2965.2660 3071.7856 3424.4129 3560.0487
redmass: 3.7013 1.8636 1.5631 6.7254 1.2329 1.2530 4.3705 3.1973 2.0705 1.0998 1.1987 1.1879 1.0789 5.9971 1.0681 1.0928 1.1595 1.0665
irintensity: 1.9075 59.4090 129.3305 15.6920 79.1710 59.5138 59.6306 69.3417 5.9942 20.9730 8.6241 28.6838 6.8649 0.2908 52.4457 11.6388 54.8257 8.4108
temp: 298.150 k
press: 1.00000 atm
elementType: 8 6 6 6 1 1 1 1
symmnumber: 1
zpe: 155087.9 jmol-1
zpe.correction: 0.059070 hartree
zpe.thermalcorrener: 0.063943 hartree
zpe.thermalcorrenthalpy: 0.064888 hartree
zpe.thermalcorrgfe: 0.032311 hartree
zpe.sumelectzpe: -191.543300 hartree
zpe.sumelectthermal: -191.538426 hartree
zpe.sumelectthermalent: -191.537482 hartree
zpe.sumelectthermalfe: -191.570058 hartree
dipole: 1.1942 0.1483 1.3289
dipole: 1.7928
quadrupole: -23.9818 -21.5435 -24.1490
quadrupole: -1.9495 -2.1403 -1.7959
quadrupole: -0.7570 1.6813 -0.9242 -1.9495 -2.1403 -1.7959
hfenergy: -191.6023696 hartree
pointgroup: C01 [X(C3H4O1)]
dipole: 0.4833658 0.1169025 0.500184 debye
dipolederiv: -0.7014759 -0.0827707 0.1821601 -0.1939826 -0.5961924 -0.1251715 0.2089262 -0.0992691 -0.2899546 0.6765271 0.1222625 -0.0666949 0.1715851 0.5785453 0.0476679 -0.0964609 0.0126007 0.3333768 -0.057108 -0.1150572 0.0294636 -0.0588853 -0.1741478 -0.0011905 0.0439713 -0.0070639 -0.091175 -0.436517 0.0209152 0.0112731 0.0537188 -0.2853169 -0.0067208 -0.0183107 0.0005 -0.3226916 0.0119415 0.020482 -0.0320613 -0.0083751 0.0440188 0.0675928 -0.0304653 0.113427 -0.0133748 -0.0239918 -0.0090355 0.0211426 -0.0182354 -0.0616557 -0.1087094 0.0321686 -0.1644809 -0.0464702 0.315451 0.0267458 -0.1457822 0.0342947 0.2455761 0.1234142 -0.14241 0.1411381 0.1580619 0.2151729 0.0164579 0.0004989 0.0198798 0.2491726 0.0031174 0.0025808 0.0031481 0.2722276 unknown
polarizability: 49.8794765|-5.901337|25.8230161|0.0274403|-1.855855|21.0177984 unknown
InChI: InChI=1S/C3H4O/c1-2-3-4/h1,4H,3H2
charge 0 multiplicity 1
8 atoms
O  -1.751043 -0.466084 0.041733
C  -0.758986 0.626142 0.014752
C  0.638282 0.154964 0.001721
C  1.803381 -0.249831 0.010631
H  -0.984158 1.179713 -0.911941
H  -0.906718 1.314028 0.873543
H  -1.518309 -1.089318 0.776777
H  2.817852 -0.605715 0.010285
