program: Gaussian 09
title: 000089868
version: EM64L-G09RevD.01
frameworkgroup: C1[X(C15H12O)]
method: RPBEPBE
basis: SDD
operation: Freq
keyword: #pfreq=noraman
keyword: PBEPBE/SDD
title: #p freq=noraman PBEPBE/SDD
converged: NO YES NO YES
title: Mulliken charges:
elementType: O C C C C C C C C C C C C C C C H H H H H H H H H H H H
charge: -0.482049 0.100784 0.217314 0.431941 0.236398 0.418310 -0.477824 -0.500650 -0.456924 -0.351507 -0.376341 -0.459638 -0.449481 -0.250354 -0.292498 -0.251574 0.236069 0.236786 0.239937 0.217511 0.302969 0.215283 0.215226 0.240407 0.229511 0.224601 0.230645 0.355147
chargesum: 0.00000
title: Mulliken charges with hydrogens summed into heavy atoms:
elementType: O C C C C C C C C C C C C C C C
charge: -0.126902 0.100784 0.217314 0.431941 0.236398 0.418310 -0.241755 -0.263864 -0.216987 -0.133996 -0.073371 -0.029129 -0.209074 -0.020844 -0.067897 -0.020928
polarizability: 2.54002498e+02 2.05604485e+01 1.96326629e+02 -1.33624211e-02 8.64633670e-03 6.69102355e+01
1716.lowfreq: -16.5197 -5.5032 -5.2639 -0.0003 0.0002 0.0007 6.4571 90.7007 157.4971
frequency: -15.5659 90.6829 157.4965 200.9674 226.8592 229.5299 251.6668 274.5711 279.7398 331.0914 396.0921 404.2163 468.4044 493.2720 504.4855 509.4816 531.5722 566.3999 595.8353 604.7521 672.1882 714.1688 729.3035 746.2389 783.0726 786.7438 805.3538 832.8446 847.3661 875.8786 929.1332 943.1302 944.9212 979.6881 983.5974 987.3881 995.4988 1007.9767 1038.1115 1055.6283 1106.0185 1126.9842 1155.9944 1168.9774 1178.7188 1191.3793 1230.0195 1232.9207 1243.1283 1246.7582 1281.6906 1298.4689 1362.3889 1385.5447 1393.3332 1411.8707 1416.7737 1436.8938 1450.0679 1486.5979 1504.4110 1535.6958 1582.8392 1605.0418 1620.2474 1635.7839 2920.1443 2974.4097 3119.0879 3121.3831 3123.8585 3133.7817 3145.4840 3150.6356 3159.5181 3185.2717 3241.8036 3585.5322
redmass: 4.6506 4.0501 4.3942 5.1049 3.5424 1.4007 2.4801 4.7026 2.3368 7.0011 6.2043 3.1119 3.2593 4.8930 5.9860 3.0571 6.8383 3.2044 5.6861 3.0813 5.5106 5.7180 3.0105 1.2705 5.0973 1.3029 1.9739 5.0789 1.7895 1.8224 1.3603 5.0223 1.4073 1.3533 7.4395 1.3726 1.3882 5.1717 1.6289 2.3489 2.1436 1.7391 1.2448 1.2519 1.1477 1.1956 1.5635 2.4631 1.0585 1.9052 1.8948 1.9308 2.7319 2.8831 3.5185 2.5072 2.1112 2.3630 2.0576 1.1924 3.0876 4.3631 7.1053 5.6543 6.1184 7.0148 1.0540 1.1059 1.0863 1.0865 1.0871 1.0907 1.0989 1.0959 1.0994 1.0938 1.0889 1.0665
irintensity: 0.2079 0.0231 0.1559 1.7140 0.0011 176.7424 12.1220 6.4229 2.3047 6.7492 0.0714 2.3475 0.6730 1.4682 0.6093 6.2187 4.0740 0.4333 22.2958 0.9208 7.2117 0.2770 17.1304 79.2026 1.0578 2.3705 0.5725 0.4270 67.6281 34.1026 1.1039 22.9241 3.9775 0.0111 1.7361 2.7477 0.5268 77.0393 0.8173 5.8001 16.2343 41.2212 21.8807 0.8093 2.0444 8.0707 6.5202 1.5418 0.0616 6.4379 8.3273 2.6030 10.4058 1.5737 2.2529 2.2832 0.0488 15.6411 19.2805 0.5115 6.1570 0.4552 3.0735 5.1817 1.0057 0.3446 42.3946 34.7704 0.6467 3.7737 5.1934 14.6153 30.5692 39.3954 37.1460 4.6157 12.1220 9.3770
temp: 298.150 k
press: 1.00000 atm
elementType: 8 6 6 6 6 6 6 6 6 6 6 6 6 6 6 6 1 1 1 1 1 1 1 1 1 1 1 1
symmnumber: 1
zpe: 585720.4 jmol-1
zpe.correction: 0.223089 hartree
zpe.thermalcorrener: 0.234437 hartree
zpe.thermalcorrenthalpy: 0.235382 hartree
zpe.thermalcorrgfe: 0.186423 hartree
zpe.sumelectzpe: -652.928085 hartree
zpe.sumelectthermal: -652.916737 hartree
zpe.sumelectthermalent: -652.915793 hartree
zpe.sumelectthermalfe: -652.964751 hartree
dipole: -0.9916 -1.4583 -0.0003
dipole: 1.7635
quadrupole: -87.3748 -71.8591 -100.2847
quadrupole: -1.4313 -0.0039 0.0016
quadrupole: -0.8686 14.6471 -13.7785 -1.4313 -0.0039 0.0016
hfenergy: -653.1511742 hartree
pointgroup: C01 [X(C15H12O1)]
dipole: -0.4310468 -0.5436827 -0.0001347 debye
polarizability: 256.6931091|16.1341042|193.6360182|-0.0126944|0.0096004|66.9102355 unknown
InChI: InChI=1S/C15H12O/c16-10-13-6-3-5-12-9-8-11-4-1-2-7-14(11)15(12)13/h1-9,16H,10H2
charge 0 multiplicity 1
28 atoms
O  2.903308 -2.876595 0.001176
C  0.529753 0.134906 -0.000105
C  -0.898252 -0.257537 -0.000102
C  0.829757 1.557754 -0.000072
C  1.670567 -0.762847 -0.00007
C  -1.918543 0.776901 0.000313
C  -0.227245 2.542619 0.000222
C  -1.551707 2.171759 0.0005
C  2.174545 2.035374 -0.00025
C  -1.385019 -1.608304 -0.000569
C  2.981731 -0.248604 -0.000235
C  1.558069 -2.285222 0.000289
C  -3.30651 0.437247 0.000446
C  3.245901 1.143367 -0.000384
C  -2.753293 -1.92078 -0.000473
C  -3.733098 -0.893734 0.000093
H  0.058091 3.601098 0.000275
H  -2.34921 2.92359 0.000799
H  2.344769 3.118376 -0.000244
H  -0.700604 -2.451896 -0.00114
H  3.805382 -0.965351 -0.000177
H  1.003628 -2.620799 0.903391
H  1.004647 -2.621331 -0.903247
H  -4.039401 1.253031 0.000795
H  4.280013 1.503707 -0.000532
H  -3.062534 -2.97203 -0.000866
H  -4.799835 -1.141386 0.000197
H  2.819988 -3.862014 0.001468
