program: Gaussian 09
title: 000089867
version: EM64L-G09RevD.01
frameworkgroup: C1[X(C16H20N2)]
method: RPBEPBE
basis: SDD
operation: Freq
keyword: #pfreq=noraman
keyword: PBEPBE/SDD
title: #p freq=noraman PBEPBE/SDD
converged: YES YES NO YES
title: Mulliken charges:
elementType: N N C C C C C C C C C C C C C C C C H H H H H H H H H H H H H H H H H H H H
charge: -0.705556 -0.705555 -0.590150 -0.590110 0.403359 0.403359 0.345944 0.345936 -0.404933 -0.404975 -0.632588 -0.632574 0.516338 0.516336 -0.454500 -0.454496 -0.849985 -0.849978 0.219399 0.215913 0.215891 0.219410 0.223357 0.223368 0.215355 0.215349 0.211791 0.211790 0.226168 0.231699 0.227360 0.226168 0.227365 0.231703 0.300711 0.300311 0.300711 0.300310
chargesum: 0.00000
title: Mulliken charges with hydrogens summed into heavy atoms:
elementType: N N C C C C C C C C C C C C C C C C
charge: -0.104535 -0.104534 -0.154837 -0.154809 0.403359 0.403359 0.345944 0.345936 -0.181576 -0.181608 -0.417233 -0.417225 0.516338 0.516336 -0.242709 -0.242706 -0.164758 -0.164742
polarizability: 2.95260073e+02 1.19021314e+01 1.91907987e+02 2.06051992e+01 -4.59852478e+00 9.84504273e+01
1716.lowfreq: -5.9598 -0.0006 -0.0004 0.0004 7.9905 12.1692 25.4678 29.2785 44.0388
frequency: 25.4678 29.2785 44.0388 76.6490 86.4017 130.9530 131.7369 149.7111 178.0184 213.9835 214.9259 291.7384 293.2877 294.8739 309.4204 311.5115 329.3125 336.5954 354.9382 355.0066 397.3547 439.5127 440.6999 454.1036 454.8302 476.8797 525.6491 548.7536 549.7323 591.1823 591.7097 717.0567 725.7212 727.0286 736.1087 745.2238 776.0433 799.7482 813.3605 833.9584 859.4876 859.5139 930.6086 935.9407 936.4792 940.5985 980.4707 989.0427 989.7179 1000.5843 1039.4033 1041.2973 1046.1832 1048.7830 1088.4733 1122.5443 1154.5744 1177.1819 1177.4290 1221.4372 1224.4390 1259.6552 1264.5322 1285.1419 1294.0755 1319.4454 1329.1358 1329.2427 1380.7699 1383.0348 1396.1243 1396.8566 1436.4300 1437.9417 1468.7680 1469.1374 1471.1411 1476.7543 1484.9302 1490.2818 1511.2399 1511.5484 1583.3103 1583.9318 1631.6667 1632.0703 1641.0718 1641.8129 2971.2440 2971.3852 2981.4688 2991.2866 3025.4412 3046.3600 3046.4973 3051.3853 3078.4239 3078.5184 3101.4410 3101.5089 3103.8415 3103.9499 3129.2601 3129.3008 3569.6511 3569.8287 3710.8821 3710.8866
redmass: 3.8978 3.9980 4.2735 4.3375 3.4870 1.1068 1.0650 4.1498 3.6759 2.7401 2.7631 2.4466 2.7144 2.0407 1.2433 1.2291 2.8197 5.4131 1.0393 1.0372 4.5263 3.6212 2.6859 2.5677 2.7546 3.5189 4.8624 4.8381 4.4461 3.0156 2.7167 2.8727 5.1733 5.7300 3.0046 3.9587 1.2574 1.7409 1.4555 2.4734 1.5674 1.5752 1.9226 1.9410 1.3976 2.9828 1.7985 4.2000 1.5005 1.5096 1.5479 1.6022 1.4781 1.4374 1.5684 1.9165 1.3164 1.6043 1.6292 1.8471 1.7791 1.3914 1.3836 1.5531 1.2657 1.3826 2.9013 2.9648 4.3555 5.1568 1.2935 1.3203 2.3195 2.4514 1.1508 1.0888 1.1815 1.2668 1.2034 1.1171 2.9084 2.6339 6.8733 6.8774 1.8980 1.8259 2.1235 2.0404 1.0374 1.0373 1.0594 1.0602 1.0995 1.0971 1.0968 1.1037 1.0985 1.0985 1.0866 1.0867 1.0906 1.0906 1.0964 1.0964 1.0446 1.0446 1.1040 1.1040
irintensity: 0.2918 0.4423 1.9935 0.0000 0.0000 0.0177 2.1633 0.0000 1.5701 0.0014 21.1757 0.0000 5.1423 0.0002 0.0014 614.4957 1.9702 0.0000 0.0028 0.0000 8.1926 1.8495 0.0000 0.0000 18.4402 6.0069 0.0000 0.0000 0.3874 0.0001 14.3150 0.0000 2.3127 0.0000 0.6619 1.5603 0.8861 0.0000 71.2774 0.0000 61.2190 0.2588 0.0000 0.0000 0.6548 5.0745 0.0000 0.0000 13.9144 0.0000 21.3478 0.0001 13.7391 0.0000 3.9494 0.0000 32.5422 0.0065 8.1144 0.0003 19.1182 0.0000 14.0022 33.8291 0.0000 0.0000 102.6720 0.0194 0.0000 12.9789 29.6282 0.0032 0.0001 11.0429 0.0003 14.6903 0.0001 28.5975 0.0001 18.3878 253.9461 0.2715 0.0064 31.8662 0.0002 3.3269 663.3979 0.0060 0.5854 64.0852 0.0002 78.1052 0.0000 43.6372 1.7033 42.2512 0.4680 55.7582 3.5251 45.2642 73.7882 1.8481 55.5081 1.0253 138.3832 0.0018 4.1311 31.4071
temp: 298.150 k
press: 1.00000 atm
elementType: 7 7 6 6 6 6 6 6 6 6 6 6 6 6 6 6 6 6 1 1 1 1 1 1 1 1 1 1 1 1 1 1 1 1 1 1 1 1
symmnumber: 1
zpe: 842465.9 jmol-1
zpe.correction: 0.320878 hartree
zpe.thermalcorrener: 0.339368 hartree
zpe.thermalcorrenthalpy: 0.340312 hartree
zpe.thermalcorrgfe: 0.273956 hartree
zpe.sumelectzpe: -729.911151 hartree
zpe.sumelectthermal: -729.892662 hartree
zpe.sumelectthermalent: -729.891718 hartree
zpe.sumelectthermalfe: -729.958074 hartree
dipole: 0.0002 -0.0004 -0.0013
dipole: 0.0013
quadrupole: -63.8492 -95.8661 -116.8701
quadrupole: 1.3881 7.8496 -1.1375
quadrupole: 28.3460 -3.6710 -24.6750 1.3881 7.8496 -1.1375
hfenergy: -730.2320298 hartree
pointgroup: C01 [X(C16H20N2)]
dipole: -0.0000959 -0.0001693 0.0004921 debye
polarizability: 295.0508986|-11.3375893|191.7746907|22.1601613|4.6155677|98.7928984 unknown
InChI: InChI=1S/C16H20N2/c1-11-9-15(17)7-5-13(11)3-4-14-6-8-16(18)10-12(14)2/h5-10H,3-4,17-18H2,1-2H3
charge 0 multiplicity 1
38 atoms
N  6.104446 -0.351684 0.392417
N  -6.102163 0.352256 -0.389078
C  0.419591 0.030146 -0.661232
C  -0.417073 -0.028531 0.663791
C  1.91982 -0.033258 -0.416831
C  -1.917379 0.034615 0.41954
C  2.700674 1.135926 -0.159556
C  -2.69807 -1.134749 0.162515
C  2.577322 -1.288842 -0.396495
C  -2.575067 1.290072 0.399274
C  4.083378 1.010737 0.106574
C  -4.080832 -1.009798 -0.10339
C  4.733191 -0.255773 0.127699
C  -4.730858 0.256618 -0.124535
C  3.954604 -1.417472 -0.131169
C  -3.952427 1.418452 0.134123
C  2.074578 2.522522 -0.182154
C  -2.071816 -2.521272 0.185317
H  0.138502 0.954292 -1.200785
H  0.107921 -0.812468 -1.308299
H  -0.105489 0.814239 1.3107
H  -0.135827 -0.952555 1.203482
H  1.990196 -2.194209 -0.600091
H  -1.988084 2.195559 0.602717
H  4.67407 1.916317 0.299892
H  -4.671441 -1.915481 -0.296498
H  4.428795 -2.406898 -0.129016
H  -4.426769 2.407806 0.131973
H  2.816273 3.298848 0.073295
H  1.665003 2.766034 -1.181326
H  1.237745 2.60737 0.536306
H  -2.813428 -3.297709 -0.070032
H  -1.234972 -2.606124 -0.533113
H  -1.662253 -2.764592 1.184541
H  6.659296 0.479199 0.572161
H  6.567952 -1.254664 0.410274
H  -6.656919 -0.478756 -0.568512
H  -6.565893 1.255127 -0.40668
